{"text_format":"3","workbook":"xlsx","n_sheets":6,"sheets":["Início","Cálculos","Feriados","Links","Aliq_INSS","Aliq_IRRF"],"not_rendered":{"images":3,"macros":1,"defined_names":66,"comments":2},"read":"whole","date_system":"1900"}

{"sheet":"Início","index":0,"n_rows":261,"n_cols":16,"rows_kept":261,"merged":[[3,2,3,3],[3,7,3,11],[3,15,3,18],[5,15,5,18],[9,15,9,18],[11,21,12,23],[12,15,15,18],[13,7,13,9],[14,7,15,10],[28,6,28,7]]}
[]
[]
[]
[null,null,"CONTRATO DE TRABALHO",{"$nulls":4},"AVISO PRÉVIO PROPORCIONAL",{"$nulls":7},"TEMPO DE SERVIÇO"]
[]
[null,null,"Remuneração :",{"v":4500,"d":"R$ 4,500.00"},{"$nulls":11},"Na data da comunicação do Aviso"]
[{"$nulls":7},1]
[null,null,"Data de Admissão :","2023-04-02",{"$nulls":11},{"$f":"diffDateP(admissão,datacom,,,0,1)","v":"9 meses 30 dias"}]
[{"$nulls":7},2]
[null,null,"Data do Aviso Prévio :","2024-01-31",{"$nulls":7},1,{"$nulls":3},"No término da projeção do aviso"]
[]
[{"$nulls":8},"Aviso :",{"$nulls":6},{"$f":"IF(OR(mot_resc=2,mot_resc=3),\"\",diffDateP(admissão,dispensa,,,0,1))","v":"11 meses "}]
[{"$nulls":15},{"$f":"IF(mot_resc=2,\"PEDIDO DE DEMISSÃO\",IF(mot_resc=3,\"TÉRMINO DE CONTRATO A TERMO\",IF(aviso1ano<>aviso1anopro,\"ATENÇÃO!!! A opção de cálculo considerando a projeção do próprio aviso prévio resulta em mais 3 dias de aviso prévio.\",\"DISPENSA SEM JUSTA CAUSA\")))","v":"DISPENSA SEM JUSTA CAUSA"}]
[{"$nulls":7},"Quantidade de dias AP:",null,null,{"$f":"ap_proporcional","v":30}]
[{"$nulls":7},{"$f":"IF(OR(AND(mot_resc=2,ap_proporcional>30),AND(mot_resc=1,OR(ap=4,ap=5))),\"ATENÇÃO!!! O tipo de aviso está em desacordo com o motivo da rescisão.\",\"\")","v":""}]
{"$rows_empty":239}
[{"$nulls":8},{"$f":"IF(OR(mot_resc=1,mot_resc=2),\"TRABALHADO\",\"TÉRMINO CONTRATO\")","v":"TRABALHADO"}]
[{"$nulls":7},2,{"$f":"IF(mot_resc=1,\"INDENIZADO\",IF(mot_resc=2,\"NÃO TRABALHADO\",\"\"))","v":"INDENIZADO"}]
[{"$nulls":8},{"$f":"IF(mot_resc=1,\"MISTO\",IF(mot_resc=2,\"DISPENSA DO CUMPRIMENTO\",\"\"))","v":"MISTO"}]
[]
[{"$nulls":12},"1 - dispensa sem justa causa"]
[{"$nulls":8},1,"motivo da dispensa ",null,null,"2 - pedido de demissão"]
[{"$nulls":12},"3 - término de contrato a termo"]

{"sheet":"Cálculos","index":1,"n_rows":229,"n_cols":20,"rows_kept":229,"merged":[[2,3,2,6],[8,3,8,4],[8,5,8,6],[8,7,8,8],[8,9,8,10],[8,11,8,12],[8,14,8,19],[9,18,9,19],[11,3,11,4],[11,5,11,6],[11,7,11,8],[11,9,11,10],[11,11,11,12],[12,14,12,16],[14,3,14,4],[14,5,14,6],[14,7,14,8],[14,9,14,10],[14,11,14,12],[14,14,14,19],[15,9,15,10],[15,11,15,12],[17,3,17,7],[17,8,17,12],[18,3,18,5],[18,8,18,10],[19,3,19,5],[19,8,19,10],[20,3,20,5],[20,8,20,10],[21,3,21,5],[21,8,21,10],[22,3,22,5],[22,8,22,10],[23,3,23,5],[24,3,24,5],[24,8,24,10],[25,3,25,5],[25,8,25,10],[25,14,25,19],[26,3,26,4],[26,8,26,10],[26,14,26,19],[27,3,27,4],[27,8,27,10],[27,14,27,15],[27,16,27,17],[28,3,28,4],[28,8,28,10],[28,14,28,15],[28,16,28,17],[29,3,29,4],[29,8,29,10],[29,14,29,15],[29,16,29,17],[30,3,30,4],[30,14,30,15],[30,16,30,17],[31,3,31,4],[31,14,31,15],[32,3,32,4],[32,8,32,10],[35,4,35,6],[35,9,35,11],[35,18,35,19],[36,4,36,6],[37,14,37,15],[38,3,43,10],[51,14,51,15],[64,13,64,14],[64,15,64,17],[64,19,64,20],[65,3,69,4],[65,8,69,10],[66,13,66,14],[68,13,68,14],[68,15,68,17],[70,13,70,14],[70,19,70,20],[71,2,71,8],[72,2,72,4],[73,2,74,4],[73,5,74,5],[73,6,74,6],[73,7,74,7],[73,8,74,8],[75,2,75,4],[76,2,76,4],[76,13,76,14],[76,15,76,17],[77,2,77,4],[105,28,105,31],[184,8,184,9],[185,8,185,9],[199,5,199,6]]}
[]
[]
[{"$nulls":3},"CÁLCULO RESCISÓRIO    -",{"$nulls":3},{"$f":"IF(mot_resc=1,\"DISPENSA SEM JUSTA CAUSA\",IF(mot_resc=2,\"PEDIDO DE DEMISSÃO\",\"TÉRMINO DE CONTRATO POR PRAZO DETERMINADO\"))","v":"DISPENSA SEM JUSTA CAUSA"}]
[]
[{"$nulls":3},"EMPRESA........... :"]
[]
[{"$nulls":3},"EMPREGADO...  :"]
[]
[{"$nulls":3},"Remuneração",null,"Admissão",null,{"$f":"IF(mot_resc=3,\"Término do Contrato\",\"Comunicação do Aviso Prévio\")","v":"Comunicação do Aviso Prévio"},null,"Tipo de Aviso",null,"Quantidade Dias de Aviso Prévio",null,null,"Parâmetros do Cálculo"]
[{"$nulls":3},{"$f":"remuneração","v":{"v":4500,"d":"R$4,500.00"}},null,{"$f":"admissão","v":"2023-04-02"},null,{"$f":"datacom","v":"2024-01-31"},null,{"$f":"IF(mot_resc=3,\"Sem aviso prévio\",IF(AND(mot_resc=2,ap<>1),\"Não Trabalhado\",IF(ap=1,\"Aviso Trabalhado\",IF(ap=2,\"Aviso Indenizado\",\"Aviso Misto\"))))","v":"Aviso Indenizado"},null,{"$f":"ap_proporcional","v":30},{"$nulls":6},"Saldo de Salários :"]
[{"$nulls":14},"Saldo de Salários, "]
[{"$nulls":3},{"$f":"IF(ap=1,\"Término do Contrato\",\"Último Dia Trabalhado\")","v":"Último Dia Trabalhado"},null,"Dias Indenizados",null,{"$f":"IF(OR(ap=1,F13=0,F13=(\"-\")),\"Término do Contrato\",\"Término da Projeção do Aviso\")","v":"Término da Projeção do Aviso"},null,"Data Limite Pagamento",null,"Férias Vencidas ?",null,null,"dividir por:"]
[{"$nulls":3},{"$f":"IF(ap=1,dispensa,IF(ap=2,datacom,datacom+30))","v":"2024-01-31"},null,{"$f":"IF(OR(mot_resc<>1,ap=1),(\"-\"),IF(ap=2,ap_proporcional,ap_proporcional-30))","v":30},null,{"$f":"datacom+ap_proporcional","v":"2024-03-01"},null,{"$f":"data_limpagto","v":"2024-02-10"},{"$nulls":4},"Jornada Mensal - Divisor:",null,null,220,"Quant. Dias S. Sal.",7]
[]
[{"$nulls":3},"Quantidade de H. Extras ",null,"Quant.  de H. Extras - 100%",null,"Quant. Ad. Noturno",null,"Atrasos e Faltas",null,"Ad. Insalubridade / Periculosidade",null,null,"Cálculos Acessórios"]
[{"$nulls":3},{"v":0.5,"d":"50%"},null,{"v":1,"d":"100%"},null,{"v":0.2,"d":"20%"},{"$nulls":3},"Não é devido",null,null,"13º salário",null,null,"Período Aquisitivo",null,"Cálculo"]
[]
[{"$nulls":3},"VENCIMENTOS",{"$nulls":4},"DESCONTOS",{"$nulls":5},"13º proporcional",null,null,{"$f":"CalcDécTerceiro(admissão,ultimo_diatrab,1)","v":"01/01/2024 a 31/01/2024"},null,{"$f":"CalcDécTerceiro(admissão,ultimo_diatrab,2)","v":1}]
[{"$nulls":3},"Saldo de Salários",null,null,{"$f":"IF(dias_ssal=1,IF(AND(MONTH(admissão)=MONTH(ultimo_diatrab),YEAR(admissão)=YEAR(ultimo_diatrab)),DAY(ultimo_diatrab)-DAY(admissão)+1,DAY(ultimo_diatrab)),IF($T$13>DAY(ultimo_diatrab),DAY(ultimo_diatrab),T13))","v":31},{"$f":"IF(G19>30,remuneração,IF(AND(MONTH(ultimo_diatrab)=2,G19=$G$195),remuneração,remuneração/$F$198*G19))","v":{"v":4500,"d":"4,500.00"}},"INSS s/ Salários",null,null,{"$f":"VLOOKUP(ultimo_diatrab,Tabela_INSS,(IF(F229<=LOOKUP(ultimo_diatrab,Inss_época,famin),3,IF(F229<=LOOKUP(ultimo_diatrab,Inss_época,famed),5,IF(F229<=LOOKUP(ultimo_diatrab,Inss_época,famaior),7,9)))),TRUE)","v":{"v":0.14,"d":"14.00%"}},{"$f":"IF(LOOKUP(ultimo_diatrab,Inss_época,Teto_Contribuição)<F229*L19,LOOKUP(ultimo_diatrab,Inss_época,Teto_Contribuição),F229*L19)-IF(OR(ultimo_diatrab<data_ninss,L19<0.09),0,IF(L19=0.09,LOOKUP(ultimo_diatrab,Inss_época,Ded_min),IF(L19=0.12,LOOKUP(ultimo_diatrab,Inss_época,Ded_med),LOOKUP(ultimo_diatrab,Inss_época,Ded_max))))","v":{"v":448.8200000000001,"d":"448.82"}},null,"13º indenizado",null,null,{"$f":"IF(OR(F13=(\"-\"),F13=0),\"\",CalcDécTerceiro(ultimo_diatrab+1,dispensa,1))","v":"01/02/2024 a 01/03/2024"},null,{"$f":"IF(ap<>1,IF(YEAR(dispensa)>YEAR(ultimo_diatrab),CalcDécTerceiro(admissão,ultimo_diaano,2)+CalcDécTerceiro(admissão,dispensa,2)-CalcDécTerceiro(admissão,ultimo_diatrab,2),CalcDécTerceiro(admissão,dispensa,2)-CalcDécTerceiro(admissão,ultimo_diatrab,2)),\"\")","v":1}]
[{"$nulls":3},"Aviso Prévio",null,null,{"$f":"IF(OR(mot_resc<>1,ap=1),\"\",$F$13)","v":30},{"$f":"IF(G20=\"\",0,remuneração/30*G20)","v":{"v":4500,"d":"4,500.00"}},"INSS s/ 13º Salário",null,null,{"$f":"VLOOKUP(ultimo_diatrab,Tabela_INSS,(IF(H21+H22<=LOOKUP(ultimo_diatrab,Inss_época,famin),3,IF(H21+H22<=LOOKUP(ultimo_diatrab,Inss_época,famed),5,IF(H21+H22<=LOOKUP(ultimo_diatrab,Inss_época,famaior),7,9)))),TRUE)","v":{"v":0.075,"d":"7.50%"}},{"$f":"IF(LOOKUP(ultimo_diatrab,Inss_época,Teto_Contribuição)<(H21+H22)*L20,LOOKUP(ultimo_diatrab,Inss_época,Teto_Contribuição),(H21+H22)*L20)-IF(OR(ultimo_diatrab<data_ninss,L20<0.09),0,IF(L20=0.09,LOOKUP(ultimo_diatrab,Inss_época,Ded_min),IF(L20=0.12,LOOKUP(ultimo_diatrab,Inss_época,Ded_med),LOOKUP(ultimo_diatrab,Inss_época,Ded_max))))","v":56.25},null,"Férias"]
[{"$nulls":3},"13º Proporcional",null,null,{"$f":"CalcDécTerceiro(admissão,ultimo_diatrab,2)","v":1},{"$f":"remuneração/12*G21","v":{"v":375,"d":"375.00"}},"I.R.R.F s/ Salários",null,null,{"$f":"VLOOKUP(ultimo_diatrab,Tabela_IRRF,(IF(K183<=LOOKUP(ultimo_diatrab,IRRF_época,Fprimeirairrf),2,IF(K183<=LOOKUP(ultimo_diatrab,IRRF_época,Fsegundairrf),5,IF(K183<=LOOKUP(ultimo_diatrab,IRRF_época,Fterceirairrf),8,IF(K183<=LOOKUP(ultimo_diatrab,IRRF_época,Fquartairrf),11,14))))),TRUE)","v":{"v":0.225,"d":"22.50%"}},{"$f":"K183*L21-K185","v":{"v":217.12774999999988,"d":"217.13"}},null,"Total:",{"$f":"INT(_FER/12)&\" - \"&TEXT(_FER-INT(_FER/12)*12,\"00\")&\"/12\"","v":"0 - 11/12"},null,"Período Aquisitivo",null,"Cálculo"]
[{"$nulls":3},"13º Indenizado",null,null,{"$f":"IF(mot_resc<>1,\"\",IF(ap<>1,IF(YEAR(dispensa)>YEAR(ultimo_diatrab),CalcDécTerceiro(admissão,ultimo_diaano,2)+CalcDécTerceiro(admissão,dispensa,2)-CalcDécTerceiro(admissão,ultimo_diatrab,2),CalcDécTerceiro(admissão,dispensa,2)-CalcDécTerceiro(admissão,ultimo_diatrab,2)),\"\"))","v":1},{"$f":"IF(G22=\"\",0,remuneração/12*G22)","v":{"v":375,"d":"375.00"}},"I.R.R.F s/ 13º Salário",null,null,{"$f":"VLOOKUP(ultimo_diatrab,Tabela_IRRF,(IF((H21+H22)<=LOOKUP(ultimo_diatrab,IRRF_época,Fprimeirairrf),2,IF((H21+H22)<=LOOKUP(ultimo_diatrab,IRRF_época,Fsegundairrf),5,IF((H21+H22)<=LOOKUP(ultimo_diatrab,IRRF_época,Fterceirairrf),8,IF((H21+H22)<=LOOKUP(ultimo_diatrab,IRRF_época,Fquartairrf),11,14))))),TRUE)","v":{"v":0,"d":"0.00%"}},{"$f":"K188*L22-K190","v":0},null,"Férias proporcionais",null,null,{"$f":"IF(T22=0,(\"-----\"),CalcFérias(admissão,ultimo_diatrab,3))","v":"02/04/2023 a 31/01/2024"},null,{"$f":"IF(ap=1,Férias_prop(admissão,ultimo_diatrab),R192)","v":10}]
[{"$nulls":3},"Férias Proporcionais",null,null,{"$f":"T22","v":10},{"$f":"remuneração/12*G23","v":{"v":3750,"d":"3,750.00"}},"Faltas / Atrasos",null,null,{"$f":"IF(J16=\"\",\"\",J16*24)","v":""},{"$f":"IF(L23=\"\",0,(bc_he/divisor)*L23)","v":0},null,"Férias Indenizadas",null,null,{"$f":"IF(OR(ap=1,F13=0,F13=(\"-\")),(\"-----\"),CalcFérias(ultimo_diatrab+1,dispensa,3))","v":"01/02/2024 a 01/03/2024"},null,{"$f":"IF(OR(ap=1,F13=0,F13=(\"-\")),0,R193)","v":1}]
[{"$nulls":3},"Férias Indenizadas",null,null,{"$f":"T23","v":1},{"$f":"remuneração/12*G24","v":{"v":375,"d":"375.00"}},{"$nulls":4},0,null,"Férias Vencidas",null,null,{"$f":"CalcFérias(admissão,ultimo_diatrab,2)","v":""},null,{"$f":"IF(VALUE(LEFT(P21,1))>0,12,0)","v":0}]
[{"$nulls":3},"Férias Vencidas",null,null,{"$f":"IF(AND($E$191,$T$24=12),12,0)","v":0},{"$f":"remuneração/12*G25","v":0},"Adiantamento do 13º salário",{"$nulls":3},0]
[{"$nulls":3},"Terço de Férias",null,null,"1/3",{"$f":"SUM(H23:H25)/3","v":{"v":1375,"d":"1,375.00"}},"Adiantamentos",{"$nulls":3},0,null,"TABELA DO INSS - 2024"]
[{"$nulls":3},"Horas Extras - ",null,{"$f":"IF(E16=\"\",0,adicional_he)","v":{"v":0,"d":"0%"}},{"$f":"IF(E16=\"\",\"\",E16*24)","v":""},{"$f":"IF(G27=\"\",0,(bc_he/divisor)*(G27*adicional_he+G27))","v":0},{"$nulls":4},{"$f":"IF(L27=\"\",0,(bc_he/divisor)*L27)","v":0},null,"SALÁRIO DE CONTRIBUIÇÃO"]
[{"$nulls":3},"Horas Extras - ",null,{"$f":"IF(G16=\"\",0,adicional_domfer)","v":{"v":0,"d":"0%"}},{"$f":"IF(G16=\"\",\"\",G16*24)","v":""},{"$f":"IF(G28=\"\",0,(bc_he/divisor)*(G28*adicional_domfer+G28))","v":0},"Vale Transporte",{"$nulls":3},0,null,0,null,{"v":1412,"d":"R$ 1,412.00"},null,{"v":0.075,"d":"7.50%"},0]
[{"$nulls":3},"Adicional Noturno - ",null,{"$f":"IF(I16=\"\",0,adicional_not)","v":{"v":0,"d":"0%"}},{"$f":"IF(I16=\"\",\"\",I16*24)","v":""},{"$f":"IF(G29=\"\",0,(bc_he/divisor)*(G29*adicional_not))","v":0},{"$nulls":4},0,null,{"v":1412.01,"d":"R$ 1,412.01"},null,{"v":2666.68,"d":"R$ 2,666.68"},null,{"v":0.09,"d":"9.00%"},{"v":21.18,"d":"R$ 21.18"}]
[{"$nulls":3},"DSR s/Horas Extras",null,null,{"$f":"J220*24","v":0},{"$f":"G30*(bc_he/divisor)","v":0},{"$nulls":4},0,null,{"v":2666.69,"d":"R$ 2,666.69"},null,{"v":4000.03,"d":"R$ 4,000.03"},null,{"v":0.12,"d":"12.00%"},{"v":101.18,"d":"R$ 101.18"}]
[{"$nulls":3},"DSR s/Ad. Noturno",null,null,{"$f":"G226*24","v":0},{"$f":"G31*(bc_he/divisor)*adicional_not","v":0},{"$nulls":4},0,null,{"v":4000.04,"d":"R$ 4,000.04"},null,{"v":7786.02,"d":"R$ 7,786.02"},null,{"v":0.14,"d":"14.00%"},{"v":181.18,"d":"R$ 181.18"}]
[{"$nulls":3},{"$f":"IF(L16=\"Não é devido\",\"\",IF(L16=\"30% - Periculosidade\",\"Ad. de Periculosidade\",\"Ad. de Insalubridade\"))","v":""},null,null,{"$f":"IF(L16=\"Não é devido\",\"\",LEFT(L16,3))","v":""},{"$f":"IF(D32=\"\",0,IF(G32=\"30%\",(D10*G32)/$F$198*$G$19,(T34*G32)/$F$198*$G$19))","v":0},{"$nulls":4},0,null,{"v":909.85,"d":"R$ 909.85"},{"$nulls":4},"2020-03-01"]
[{"$nulls":7},0,{"$nulls":4},0]
[{"$nulls":7},0,{"$nulls":4},0,null,"Salário mínimo vigente no mês da rescisão contratual:",{"$nulls":4},{"$f":"VLOOKUP(YEAR(dispensa),S37:T49,2,0)","v":{"v":1412,"d":"R$ 1,412.00"}}]
[{"$nulls":7},0,{"$nulls":4},0]
[{"$nulls":4},"TOTAL DE VENCIMENTOS:",null,null,{"$f":"SUM(H19:H35)","v":{"v":15250,"d":"15,250.00"}},null,"TOTAL DE DESCONTOS:",null,null,{"$f":"SUM(M19:M35)","v":{"v":722.19775,"d":"722.20"}},null,"Dependentes para IR:",null,1,null,"Tabela Salário Mínimo"]
[{"$nulls":4},"VALOR LÍQUIDO DA RESCISÃO:",null,null,{"$f":"H36-M36","v":{"v":14527.80225,"d":"14,527.80"}},{"$nulls":10},2012,{"v":622,"d":"R$ 622.00"}]
[{"$nulls":14},"Desconto Simplificado IR",null,"NÃO",null,2013,{"v":678,"d":"R$ 678.00"}]
[{"$nulls":3},{"$f":"IF(ap=1,CONCATENATE(\"Aviso trabalhado de\"&\" \"&$L$10&\" \"&\"dias,\"&\" \"&\"sendo que o último dia trabalhado foi o dia\"&\" \"&TEXT(ultimo_diatrab,\"dd/mm/aaaa\")&\".\"),CONCATENATE(\"De acordo com a IN nº 15/2010 da SRT/MTE, e com a OJ nº 82, do TST, na página da CTPS do empregado, onde se encontra anotado o contrato de trabalho, o empregador deverá fazer constar como data da efetiva saída a data do dia\"&\" \"&TEXT(dispensa,\"dd/mm/aaaa\")&\" \"&\"e, em uma das páginas destinadas às anotações gerais, deverá constar a observação de que o último dia efetivamente trabalhado pelo empregado foi o dia\"&\" \"&TEXT(ultimo_diatrab,\"dd/mm/aaaa\")&\".\"))","v":"De acordo com a IN nº 15/2010 da SRT/MTE, e com a OJ nº 82, do TST, na página da CTPS do empregado, onde se encontra anotado o contrato de trabalho, o empregador deverá fazer constar como data da efetiva saída a data do dia 01/03/2024 e, em uma das páginas destinadas às anotações gerais, deverá constar a observação de que o último dia efetivamente trabalhado pelo empregado foi o dia 31/01/2024."},{"$nulls":14},2014,{"v":724,"d":"R$ 724.00"}]
[{"$nulls":18},2015,{"v":788,"d":"R$ 788.00"}]
[{"$nulls":18},2016,{"v":880,"d":"R$ 880.00"}]
[{"$nulls":18},2017,{"v":937,"d":"R$ 937.00"}]
[{"$nulls":18},2018,{"v":954,"d":"R$ 954.00"}]
[{"$nulls":18},2019,{"v":998,"d":"R$ 998.00"}]
[{"$nulls":18},2020,{"v":1045,"d":"R$ 1,045.00"}]
[{"$nulls":3},"Indenização da data base - artigo 9ª das Leis nº 6.708/1979 e 7.238/1984:",{"$nulls":14},2021,{"v":1100,"d":"R$ 1,100.00"}]
[{"$nulls":18},2022,{"v":1212,"d":"R$ 1,212.00"}]
[{"$nulls":18},2023,{"v":1320,"d":"R$ 1,320.00"}]
[{"$nulls":5},"Data Base","Térm. AP",{"$nulls":11},2024,{"v":1412,"d":"R$ 1,412.00"}]
[]
[{"$nulls":5},"2022-04-01",{"$f":"dispensa","v":"2024-03-01"},{"$f":"IF($F$51=\"\",\"\",IF(AND(dispensa<$F$51,dispensa>=$F$51-30),\"É devida\",\"Não é devida\"))","v":"Não é devida"},{"$f":"IF(H51=\"É devida\",remuneração,0)","v":0}]
[]
[]
[]
[]
[{"$nulls":3},"Multa do artigo 477, da CLT :"]
[]
[]
[]
[{"$nulls":5},"2022-02-18",{"$f":"IF(F60=\"\",\"\",IF(F60>data_limpagto,\"É devida\",\"Não é devida\"))","v":"Não é devida"},{"$f":"IF(F60>data_limpagto,remuneração,0)","v":0}]
[]
[]
[]
[]
[]
[{"$nulls":3},"De acordo com a Lei nº 13.467, que alterou a redação do artigo 477, da CLT, o empregador tem até 10 (dez) dias para efetuar o pagamento:",{"$nulls":4},{"$f":"CONCATENATE(\"ATENÇÃO!!!  O PRAZO LIMITE PARA PAGTO DAS VERBAS RESCISÓRIAS É ATÉ:\"&\" \"&(IF($C$171=1,$G$169,IF($C$171=2,$G$170,IF($C$171=3,$G$171,$G$172)))))","v":"ATENÇÃO!!!  O PRAZO LIMITE PARA PAGTO DAS VERBAS RESCISÓRIAS É ATÉ: sábado, 10/fevereiro/2024"}]
[]
[]
[]
[]
[]
[null,null,"DEMONSTRATIVO DO VALOR DO FGTS A SER DEPOSITADO NO MÊS DA RESCISÃO"]
[null,null,"Saldo para Fins Rescisórios:",null,null,{"v":13000,"d":"13,000.00"}]
[{"$nulls":5},"Mês Anterior a Rescisão","MÊS Rescisão","Aviso Prévio Indenizado","Multa Rescisória"]
[]
[null,null,"Remuneração / Saldo",null,null,0,{"$f":"H19+H21+H22+H27+H28+H29+H30+H31+H32","v":{"v":5250,"d":"5,250.00"}},{"$f":"H20","v":{"v":4500,"d":"4,500.00"}},{"$f":"IF(mot_resc=1,F73+SUM(F76:H76)*8%,0)","v":{"v":13780,"d":"13,780.00"}}]
[null,null,"Depósito",null,null,{"$f":"IF(F76>0,F76*8%,0)","v":0},{"$f":"IF(G76>0,G76*8%,0)","v":{"v":420,"d":"420.00"}},{"$f":"IF(H76>0,H76*8%,0)","v":{"v":360,"d":"360.00"}},{"$f":"I76*40%","v":{"v":5512,"d":"5,512.00"}}]
[null,null,"Valor devido para o trabalhador:",null,null,{"$f":"SUM(F77:I77)","v":{"v":6292,"d":"R$ 6,292.00"}}]
[]
[]
[]
[]
[{"$nulls":9},{"$f":"F13","v":30}]
{"$rows_empty":78}
[null,null,1,null,50]
[]
[null,null,{"$f":"IF(AND(mot_resc=2,ap=1),30,IF(OR(AND(mot_resc=2,ap<>1),mot_resc=3),0,IF(_aviso=1,aviso1anopro,aviso1ano)))","v":30}]
[]
[null,null,{"$f":"Avisoprévio2(admissão,datacom)","v":30}]
[null,null,{"$f":"Avisoprévio2P(admissão,datacom)","v":30}]
[]
[{"$nulls":4},"Antecipa o pagamento",null,{"$f":"TEXT(WORKDAY(ultimo_diatrab+10+1,-1,Fer),\"dddd, dd/mmmm/aaaa\")","v":"sexta-feira, 09/fevereiro/2024"},null,{"$f":"WORKDAY(ultimo_diatrab+10+1,-1,Fer)","v":"2024-02-09"}]
[{"$nulls":4},"Pagto. Primeiro dia útil",null,{"$f":"TEXT(WORKDAY(ultimo_diatrab+10-1,1,Fer),\"dddd, dd/mmmm/aaaa\")","v":"segunda-feira, 12/fevereiro/2024"},null,{"$f":"WORKDAY(ultimo_diatrab+10-1,1,Fer)","v":"2024-02-12"}]
[null,null,4,null,"Sábado dia útil antecipa",null,{"$f":"TEXT(WORKDAY.INTL(ultimo_diatrab+10+1,-1,11,Fer),\"dddd, dd/mmmm/aaaa\")","v":"sábado, 10/fevereiro/2024"},null,{"$f":"WORKDAY.INTL(ultimo_diatrab+10+1,-1,11,Fer)","v":"2024-02-10"}]
[{"$nulls":4},"Sábado dia útil prorroga",null,{"$f":"TEXT(WORKDAY.INTL(ultimo_diatrab+10-1,1,11,Fer),\"dddd, dd/mmmm/aaaa\")","v":"sábado, 10/fevereiro/2024"},null,{"$f":"WORKDAY.INTL(ultimo_diatrab+10-1,1,11,Fer)","v":"2024-02-10"}]
[{"$nulls":13},2250]
[{"$nulls":4},{"$f":"IF($C$171=1,$I$169,IF($C$171=2,$I$170,IF($C$171=3,$I$171,$I$172)))","v":"2024-02-10"},"data limite pagamento",{"$nulls":7},{"$f":"N173/9","v":250}]
[{"$nulls":13},{"$f":"N174*12","v":3000},{"$f":"N175/12","v":250}]
[{"$nulls":3},{"$f":"WEEKDAY(datacom+10)","v":7}]
[{"$nulls":3},{"$f":"WEEKDAY(datacom+30)","v":6}]
[{"$nulls":3},{"$f":"WEEKDAY(datacom+31)","v":7},{"$f":"TEXT(IF(OR(WEEKDAY(dispensa+1)=1,COUNTIF(Fer,dispensa+1)=1),IF(OR(WEEKDAY(dispensa+2)=1,COUNTIF(Fer,dispensa+2)=1),dispensa+3,dispensa+2),dispensa+1),\"dddd, dd/mmmm/aaaa\")","v":"sábado, 02/março/2024"}]
[{"$nulls":3},{"$f":"WEEKDAY(datacom+32)","v":1},{"$f":"IF(ap=3,TEXT(IF(OR(WEEKDAY(datacom+31)=1,COUNTIF(Fer,datacom+31)=1),IF(OR(WEEKDAY(datacom+32)=1,COUNTIF(Fer,datacom+32)=1),datacom+33,datacom+32),datacom+31),\"dddd, dd/mmmm/aaaa\"))","v":false}]
[{"$nulls":3},{"$f":"WEEKDAY(datacom+33)","v":2}]
[]
[null,null,{"v":0.5,"d":"50%"},null,{"$f":"IF(E164=2,IF(OR(WEEKDAY(10)=1,COUNTIF(Fer,ultimo_diatrab+10)=1),IF(OR(WEEKDAY(ultimo_diatrab+11)=1,COUNTIF(Fer,ultimo_diatrab+11)=1),ultimo_diatrab+12,ultimo_diatrab+11),ultimo_diatrab+10),IF(OR(WEEKDAY(ultimo_diatrab+10)=1,COUNTIF(Fer,ultimo_diatrab+10)=1),IF(OR(WEEKDAY(ultimo_diatrab+9)=1,COUNTIF(Fer,ultimo_diatrab+9)=1),ultimo_diatrab+8,ultimo_diatrab+9),ultimo_diatrab+10))","v":"2024-02-10"},{"$f":"E182","v":"2024-02-10"},null,null,"Base  Cálc IRRF","INSS devido","BC IRRF","SIM",null,null,{"$f":"N185-1","v":"2023-04-01"}]
[null,null,{"v":0.6,"d":"60%"},{"$nulls":5},{"$f":"F229","v":{"v":4500,"d":"4,500.00"}},{"$f":"M19","v":{"v":448.8200000000001,"d":"448.82"}},{"$f":"IF($Q$38=\"SIM\",(I183-K186),(I183-J183-J184))","v":{"v":3861.5899999999997,"d":"3,861.59"}},"NÃO"]
[null,null,{"v":0.7,"d":"70%"},null,{"$f":"DATE(YEAR(ultimo_diatrab),12,31)","v":"2024-12-31"},{"$nulls":3},"Dependentes",{"$f":"VLOOKUP(ultimo_diatrab,Tabela_IRRF,16)*depen_qtd","v":189.59}]
[null,null,{"v":0.75,"d":"75%"},{"$nulls":5},"Parcela deduzir",null,{"$f":"VLOOKUP(ultimo_diatrab,Tabela_IRRF,(IF(K183<=LOOKUP(ultimo_diatrab,IRRF_época,Fprimeirairrf),3,IF(K183<=LOOKUP(ultimo_diatrab,IRRF_época,Fsegundairrf),6,IF(K183<=LOOKUP(ultimo_diatrab,IRRF_época,Fterceirairrf),9,IF(K183<=LOOKUP(ultimo_diatrab,IRRF_época,Fquartairrf),12,15))))),TRUE)","v":651.73},"BC IRRF Dsimpl.",null,{"$f":"admissão","v":"2023-04-02"}]
[null,null,{"v":0.8,"d":"80%"},null,{"$f":"IF(ap=1,DATE(YEAR(ultimo_diatrab)+2,MONTH(ultimo_diatrab),DAY(ultimo_diatrab)+1),DATE(YEAR(dispensa)+2,MONTH(dispensa),DAY(dispensa)+1))","v":"2026-03-02"},"prescrição total BIENAL",null,null,"Desconto Simplificado",null,{"v":528,"d":"528.00"},{"$f":"I183-J183-K186","v":{"v":3523.18,"d":"3,523.18"}},null,{"$f":"ultimo_diatrab","v":"2024-01-31"},{"$f":"IF(N187=\"\",\"\",DATE(YEAR(N186),MONTH(N186),DAY(N185)-1))","v":"2024-01-01"},{"$f":"IF(N187=\"\",\"\",IF(O186<N187,O186,DATE(YEAR(N186),MONTH(N186-1),DAY(N186-1))))","v":"2024-01-01"}]
[null,null,{"v":0.85,"d":"85%"},{"$nulls":5},"Base de Cálculo IRRF 13º Salário",{"$nulls":4},{"$f":"dispensa","v":"2024-03-01"},null,{"$f":"P186+1","v":"2024-01-02"}]
[null,null,{"v":0.9,"d":"90%"},null,"SIM",1,null,null,{"$f":"H21+H22","v":{"v":750,"d":"750.00"}},{"$f":"M20","v":56.25},{"$f":"IF($Q$38=\"SIM\",(I188-K186),(I188-J188-J184))","v":{"v":504.15999999999997,"d":"504.16"}},{"$nulls":3},{"$f":"IF(N187=\"\",\"\",IF(DAY(N185)-1>DAY(N186),DATE(YEAR(N186),MONTH(N186)-1,DAY(N185)-1),DATE(YEAR(N186),MONTH(N186),DAY(N185)-1)))","v":"2024-01-01"},null,{"$f":"IF(N187=\"\",\"\",IF(DAY(N185)-1>DAY(N186),DATE(YEAR(N186),MONTH(N186)-1,DAY(N185)-1),DATE(YEAR(N186),MONTH(N186),DAY(N1851)-1)))","v":45290}]
[{"$nulls":4},"NÃO",null,1,{"$nulls":7},{"$f":"O188+1","v":"2024-01-02"}]
[null,null,{"v":0.2,"d":"20%"},{"$nulls":5},"Parcela deduzir",null,{"$f":"VLOOKUP(ultimo_diatrab,Tabela_IRRF,(IF(K188<=LOOKUP(ultimo_diatrab,IRRF_época,Fprimeirairrf),3,IF(K188<=LOOKUP(ultimo_diatrab,IRRF_época,Fsegundairrf),6,IF(K188<=LOOKUP(ultimo_diatrab,IRRF_época,Fterceirairrf),9,IF(K188<=LOOKUP(ultimo_diatrab,IRRF_época,Fquartairrf),12,15))))),TRUE)","v":0}]
[null,null,{"v":0.25,"d":"25%"},null,true,{"$nulls":6},1]
[null,null,{"v":0.3,"d":"30%"},{"$nulls":5},{"$f":"IF(ferias_propterm>dispensa,dispensa,ferias_propterm)","v":"2024-01-01"},"férias propind",null,2,{"$nulls":5},{"$f":"R195+R196","v":10},"férias proporcionais"]
[null,null,{"v":0.35,"d":"35%"},null,2,{"$nulls":3},{"$f":"DATE(YEAR(ultimo_diatrab),MONTH(ultimo_diatrab),DAY(admissão)-1)","v":"2024-01-01"},"férias propterm",null,3,{"$nulls":5},{"$f":"R198","v":1},"férias indenizadas"]
[null,null,{"v":0.4,"d":"40%"},{"$nulls":8},4]
[null,null,{"v":0.45,"d":"45%"},null,"Ultimo dia trab",{"$f":"EOMONTH(ultimo_diatrab,0)","v":"2024-01-31"},{"$f":"DAY(F195)","v":31},null,"último dia trabalhado",null,null,5,null,{"$f":"CalcFérias(admissão,O188,3)","v":"02/04/2023 a 01/01/2024"},{"$nulls":3},{"$f":"Férias_prop(admissão,O188)","v":9},"férias proporcionais - ultimo dia trab"]
[null,null,{"v":0.5,"d":"50%"},null,"Mês dispensa",{"$f":"MONTH(ultimo_diatrab)","v":1},null,null,"retorno afastamento",null,null,6,null,{"$f":"CalcFérias(O189,ultimo_diatrab,3)","v":"02/01/2024 a 31/01/2024"},{"$nulls":3},{"$f":"Férias_prop(O189,ultimo_diatrab)","v":1}]
[{"$nulls":8},1,null,null,7,null,{"$f":"CalcFérias(O189,dispensa,3)","v":"02/01/2024 a 01/03/2024"},{"$nulls":3},{"$f":"Férias_prop(O189,dispensa)","v":2},"férias indenizadas - período específico"]
[{"$nulls":4},"Divisor salário",{"$f":"IF(E193=1,30,IF(G195=28,28,IF(G195=29,29,IF(G195=31,31,30))))","v":31},{"$nulls":5},8,{"$nulls":5},{"$f":"R197-R196","v":1},"´férias indenizadas"]
[{"$nulls":11},9,null,{"$f":"CalcFérias(admissão,dispensa,3)","v":"02/04/2023 a 01/03/2024"},{"$nulls":3},{"$f":"Férias_prop(admissão,dispensa)","v":11},"total de férias proporcionais"]
[{"$nulls":3},"Não é devido",null,"base de cálculo HE e AD",{"$nulls":5},10]
[{"$nulls":3},"10% - Insalubre",null,{"$f":"IF(G32=\"\",0,IF(G32=\"30%\",remuneração*0.3,sal_mínimo*G32))","v":0},{"$f":"F201+remuneração","v":{"v":4500,"d":"R$ 4,500.00"}},{"$nulls":4},11]
[{"$nulls":3},"20% - Insalubre",{"$nulls":7},12]
[{"$nulls":3},"30% - Periculosidade",null,{"$f":"D10","v":{"v":4500,"d":"R$4,500.00"}},{"$f":"F203*30%","v":{"v":1350,"d":"R$ 1,350.00"}},{"$nulls":4},13]
[{"$nulls":3},"40% - Insalubre",{"$nulls":7},14]
[{"$nulls":11},15]
[null,null,90,null,2010,{"$nulls":6},16]
[null,null,100,null,2011,{"$nulls":3},{"$f":"remuneração*0.3","v":1350},null,null,17]
[null,null,120,null,2012,{"$nulls":6},18]
[null,null,150,null,2013,{"$nulls":6},19]
[null,null,180,null,2014,{"$nulls":6},20]
[null,null,200,null,2015,{"$nulls":6},21]
[null,null,210,null,2016,{"$nulls":6},22]
[null,null,220,null,2017,{"$nulls":6},23]
[{"$nulls":4},2018,{"$nulls":6},24]
[{"$nulls":5},"Dias Úteis","Dias no Mês","Repousos","Domingos",null,null,25,null,{"$f":"G218*24","v":{"v":0,"d":"0.00"}},{"$f":"N215*1.5","v":{"v":0,"d":"0.00"}}]
[{"$nulls":3},{"$f":"DATE(YEAR(ultimo_diatrab),MONTH(ultimo_diatrab),1)","v":"2024-01-01"},{"$f":"ultimo_diatrab","v":"2024-01-31"},{"$f":"IF(D216=\"\",\"\",SUMPRODUCT((WEEKDAY(ROW(INDIRECT(D216&\":\"&E216)),2)<7)*(COUNTIF(Fer,ROW(INDIRECT(D216&\":\"&E216)))=0)))","v":26},{"$f":"E216-D216+1","v":31},{"$f":"G216-F216","v":5},{"$f":"IF(D216=\"\",\"\",SUMPRODUCT((WEEKDAY(ROW(INDIRECT($D216&\":\"&$E216)))=1)*1))","v":4},null,null,26,null,{"$f":"G219*24","v":{"v":0,"d":"0.00"}},{"$f":"N216*2","v":{"v":0,"d":"0.00"}}]
[{"$nulls":11},27,null,null,{"$f":"O215+O216","v":{"v":0,"d":"0.00"}}]
[{"$nulls":5},{"$f":"$E$16","v":0},{"$f":"F218/dias_úteis*repousos","v":0},{"$f":"F218+G218","v":0},{"$f":"G218*adicional_he+G218","v":0},{"$f":"I218","v":0},null,28]
[{"$nulls":5},{"$f":"$G$16","v":0},{"$f":"F219/dias_úteis*repousos","v":0},{"$f":"F219+G219","v":0},{"$f":"G219*2","v":0},{"$f":"I219","v":0},null,29]
[{"$nulls":9},{"$f":"J218+J219","v":0},{"$f":"J220*24*(bc_he/divisor)","v":{"v":0,"d":"0.00"}},30]
[{"$nulls":11},31]
[{"$nulls":5},{"$f":"G218*24*(bc_he/divisor)*1.5","v":{"v":0,"d":"0.00"}},5,{"$f":"G222*1.5","v":7.5}]
[{"$nulls":5},{"$f":"G219*24*(bc_he/divisor)*2","v":{"v":0,"d":"0.00"}},2.5,{"$f":"G223*2","v":5}]
[{"$nulls":5},{"$f":"F222+F223","v":{"v":0,"d":"0.00"}},null,{"$f":"H222+H223","v":12.5},{"$f":"H224*(bc_he/divisor)","v":{"v":255.68181818181816,"d":"255.68"}},{"$nulls":3},{"$f":"H27","v":0},{"$f":"H32","v":0},null,{"$f":"N224+N225+N226+N227","v":0}]
[{"$nulls":10},{"$f":"H19","v":{"v":4500,"d":"4,500.00"}},null,{"$f":"H28","v":0},{"$f":"H33","v":0},null,{"$f":"P224-N228","v":0}]
[{"$nulls":5},{"$f":"$I$16","v":0},{"$f":"$F$226/dias_úteis*repousos","v":0},{"$nulls":5},{"$f":"H29","v":0},{"$f":"H34","v":0}]
[{"$nulls":12},{"$f":"H30","v":0},{"$f":"H35","v":0}]
[{"$nulls":5},"Remuneração base de cálculo verbas salariais - faltas/atrasos",{"$nulls":6},{"$f":"H31","v":0},{"$f":"M23","v":0}]
[{"$nulls":5},{"$f":"H19+SUM(H27:H35)-M23","v":{"v":4500,"d":"4,500.00"}}]

{"sheet":"Feriados","index":2,"n_rows":115,"n_cols":55,"rows_kept":115,"merged":[[0,1,0,8],[0,10,1,16],[2,10,3,11],[2,12,3,15],[2,16,3,16],[5,18,5,20],[14,10,14,16],[26,1,26,5],[26,7,26,9],[30,7,31,9],[38,3,38,5],[39,3,39,5],[40,3,40,5],[41,3,41,5],[42,3,42,5],[43,3,43,5],[44,3,44,5],[45,3,45,5],[46,3,46,5],[47,3,47,5]]}
[null,"TABELA AUTOMÁTICA DE TODOS OS FERIADOS NACIONAIS - RELIGIOSOS E LOCAIS",{"$nulls":8},"CALENDÁRIO"]
[null,"FERIADOS",{"$f":"ano-5","v":2019},{"$f":"ano-4","v":2020},{"$f":"ano-3","v":2021},{"$f":"ano-2","v":2022},{"$f":"ano-1","v":2023},{"$f":"YEAR(dispensa)","v":2024},{"$f":"ano+1","v":2025}]
[null,"Confraternização Universal",{"$f":"DATE(C2,1,1)","v":"2019-01-01"},{"$f":"DATE(D2,1,1)","v":"2020-01-01"},"2021-01-01","2022-01-01","2023-01-01","2024-01-01","2025-01-01",null,2024,null,{"$f":"INDEX(Meses,MATCH(Q3,NMês,0))","v":"Janeiro"},{"$nulls":3},1]
[null,"Tiradentes",{"$f":"DATE(C2,4,21)","v":"2019-04-21"},"2020-04-21","2021-04-21","2022-04-21","2023-04-21","2024-04-21","2025-04-21"]
[null,"Dia do Trabalho",{"$f":"DATE(C2,5,1)","v":"2019-05-01"},"2020-05-01","2021-05-01","2022-05-01","2023-05-01","2024-05-01","2025-05-01",null,"Seg","Ter","Qua","Qui","Sex","Sab","Dom"]
[null,"Independência do Brasil",{"$f":"DATE(C2,9,7)","v":"2019-09-07"},"2020-09-07","2021-09-07","2022-09-07","2023-09-07","2024-09-07","2025-09-07",null,{"$f":"PDia-WEEKDAY(PDia,3)","v":"2024-01-01"},{"$f":"K6+1","v":"2024-01-02"},"2024-01-03","2024-01-04","2024-01-05","2024-01-06","2024-01-07",null,"Dias úteis do mês escolhido:",null,null,"Seg a Sab","Sem Fer."]
[null,"N. Sra. Aparecida (Lei 6.802/1980)",{"$f":"DATE(C2,10,12)","v":"2019-10-12"},"2020-10-12","2021-10-12","2022-10-12","2023-10-12","2024-10-12","2025-10-12",null,{"$f":"Q6+1","v":"2024-01-08"},"2024-01-09","2024-01-10","2024-01-11","2024-01-12","2024-01-13","2024-01-14",null,{"$f":"PDia","v":"2024-01-01"},"a",{"$f":"DATE(YEAR(S7),MONTH(S7)+1,0)","v":"2024-01-31"},{"$f":"SUMPRODUCT((WEEKDAY(ROW(INDIRECT(S7&\":\"&U7)),2)<7)*1)","v":27},{"$f":"SUMPRODUCT((WEEKDAY(ROW(INDIRECT(S7&\":\"&U7)),2)<7)*(COUNTIF(Fer,ROW(INDIRECT(S7&\":\"&U7)))=0))","v":26}]
[null,"Dia de Finados",{"$f":"DATE(C2,11,2)","v":"2019-11-02"},"2020-11-02","2021-11-02","2022-11-02","2023-11-02","2024-11-02","2025-11-02",null,{"$f":"Q7+1","v":"2024-01-15"},"2024-01-16","2024-01-17","2024-01-18","2024-01-19","2024-01-20","2024-01-21"]
[null,"Proclamação da República",{"$f":"DATE(C2,11,15)","v":"2019-11-15"},"2020-11-15","2021-11-15","2022-11-15","2023-11-15","2024-11-15","2025-11-15",null,{"$f":"Q8+1","v":"2024-01-22"},{"$f":"K9+1","v":"2024-01-23"},{"$f":"L9+1","v":"2024-01-24"},"2024-01-25","2024-01-26","2024-01-27","2024-01-28"]
[null,"Dia da Consciência Negra",{"$f":"DATE(C2,11,20)","v":"2019-11-20"},"2020-11-20","2021-11-20","2022-11-20","2023-11-20","2024-11-20","2025-11-20",null,{"$f":"Q9+1","v":"2024-01-29"},{"$f":"K10+1","v":"2024-01-30"},"2024-01-31","2024-02-01","2024-02-02","2024-02-03","2024-02-04"]
[null,"Natal",{"$f":"DATE(C2,12,25)","v":"2019-12-25"},"2020-12-25","2021-12-25","2022-12-25","2023-12-25","2024-12-25","2025-12-25",null,{"$f":"Q10+1","v":"2024-02-05"},{"$f":"K11+1","v":"2024-02-06"},"2024-02-07","2024-02-08","2024-02-09","2024-02-10","2024-02-11"]
[null,"Feriado Municipal 1",{"$f":"DATE(C2,mes_1,dia_1)","v":"2019-06-12"},"2020-06-12","2021-06-12","2022-06-12","2023-06-12","2024-06-12","2025-06-12"]
[{"$f":"fsexta","v":1},"Feriado Municipal 2",{"$f":"DATE(C2,mes_2,dia_2)","v":"2019-06-24"},"2020-06-24","2021-06-24","2022-06-24","2023-06-24","2024-06-24","2025-06-24"]
[{"$f":"fcorpus","v":1},"Sexta-feira santa",{"$f":"IF($A$13=1,$C$18-2,$BC$115)","v":"2019-04-19"},{"$f":"IF($A$13=1,$D$18-2,$BC$115)","v":"2020-04-10"},{"$f":"IF($A$13=1,$E$18-2,$BC$115)","v":"2021-04-02"},{"$f":"IF($A$13=1,$F$18-2,$BC$115)","v":"2022-04-15"},{"$f":"IF($A$13=1,$G$18-2,$BC$115)","v":"2023-04-07"},{"$f":"IF($A$13=1,$H$18-2,$BC$115)","v":"2024-03-29"},{"$f":"IF($A$13=1,$I$18-2,$BC$115)","v":"2025-04-18"}]
[{"$f":"fcarnaval","v":0},"Corpus Christi",{"$f":"IF($A$14=1,$C$18+60,$BC$115)","v":"2019-06-20"},{"$f":"IF($A$14=1,$D$18+60,$BC$115)","v":"2020-06-11"},{"$f":"IF($A$14=1,$E$18+60,$BC$115)","v":"2021-06-03"},{"$f":"IF($A$14=1,$F$18+60,$BC$115)","v":"2022-06-16"},{"$f":"IF($A$14=1,$G$18+60,$BC$115)","v":"2023-06-08"},{"$f":"IF($A$14=1,$H$18+60,$BC$115)","v":"2024-05-30"},{"$f":"IF($A$14=1,$I$18+60,$BC$115)","v":"2025-06-19"},null,{"$f":"TODAY()","v":"2024-02-04"}]
[null,"Terça-Feira de Carnaval",{"$f":"IF($A$15=1,$C$18-47,$BC$115)","v":"1905-01-03"},{"$f":"IF($A$15=1,$D$18-47,$BC$115)","v":"1905-01-03"},{"$f":"IF($A$15=1,$E$18-47,$BC$115)","v":"1905-01-03"},{"$f":"IF($A$15=1,$F$18-47,$BC$115)","v":"1905-01-03"},{"$f":"IF($A$15=1,$G$18-47,$BC$115)","v":"1905-01-03"},{"$f":"IF($A$15=1,$H$18-47,$BC$115)","v":"1905-01-03"},{"$f":"IF($A$15=1,I18-47,$BC$115)","v":"1905-01-03"}]
[]
[null,"DOMINGO DE PÁSCOA",{"$f":"DATE(C2,IF((25-MOD((11*MOD(C2-1900,19)+4-INT((7*MOD(C2-1900,19)+1)/19)),29)-MOD(C2-1900+INT((C2-1900)/4)+31-MOD((11*MOD(C2-1900,19)+4-INT((7*MOD(C2-1900,19)+1)/19)),29),7))>0,4,3),IF((25-MOD((11*MOD(C2-1900,19)+4-INT((7*MOD(C2-1900,19)+1)/19)),29)-MOD(C2-1900+INT((C2-1900)/4)+31-MOD((11*MOD(C2-1900,19)+4-INT((7*MOD(C2-1900,19)+1)/19)),29),7))>0,(25-MOD((11*MOD(C2-1900,19)+4-INT((7*MOD(C2-1900,19)+1)/19)),29)-MOD(C2-1900+INT((C2-1900)/4)+31-MOD((11*MOD(C2-1900,19)+4-INT((7*MOD(C2-1900,19)+1)/19)),29),7)),31+(25-MOD((11*MOD(C2-1900,19)+4-INT((7*MOD(C2-1900,19)+1)/19)),29)-MOD(C2-1900+INT((C2-1900)/4)+31-MOD((11*MOD(C2-1900,19)+4-INT((7*MOD(C2-1900,19)+1)/19)),29),7))))","v":"2019-04-21"},"2020-04-12","2021-04-04","2022-04-17","2023-04-09","2024-03-31","2025-04-20"]
[]
[]
[null,"Carnaval",{"$f":"TEXT(C16,\"ddd\")","v":"ter"},"ter","ter","ter","ter","ter","ter"]
[null,"Sexta-feira ",{"$f":"TEXT(C14,\"ddd\")","v":"sex"},"sex","sex","sex","sex","sex","sex"]
[null,"Páscoa",{"$f":"TEXT(C18,\"ddd\")","v":"dom"},"dom","dom","dom","dom","dom","dom"]
[null,"Corpus Christi",{"$f":"TEXT(C15,\"ddd\")","v":"qui"},"qui","qui","qui","qui","qui","qui"]
[]
[]
[null,"Instruções para o preenchimento dos feriados municipais e estaduais:",{"$nulls":5},"FERIADOS MUNICIPAIS"]
[null,"Insira na tabela ao lado, os feriados fixos do seu município.",{"$nulls":5},"FERIADOS","MÊS","DIA"]
[null,"Nas colunas MÊS E DIA, digite o algarismo correspondente, apagando os dados",{"$nulls":5},"Local 1",6,12]
[null,"do exemplo,  que referem-se aos dois feriados municipais de Foz do Iguaçu/PR.",{"$nulls":5},"Local 2",6,24]
[null,"Para feriados móveis, use a tabela de feriados móveis (por exemplo, terça-feira de carnaval não é ",{"$nulls":5},"EDITE ACIMA OS FERIADOS MUNICIPAIS FIXOS, ALTERANDO DIA E MÊS"]
[null,"feriado na maior parte dos municípios > basta desmarcar a cx de seleção)."]
[]
[]
[null,"Contato:"]
[null,"gilber.braga@bol.com.br"]
[]
[]
[null,"FERIADOS","Fixo / Móvel","LEGISLAÇÃO CORRESPONDENTE"]
[null,"Confraternização Universal - 01 de janeiro","Data fixa","Lei 666, de 06/04/1949, art. 1º"]
[null,"Dia de Tiradentes - 21 de abril","Data fixa","Lei 1.266, de 08/12/1950,art. 3º; Lei 662, de 06/04/1949, art. 1º"]
[null,"Dia do Trabalho - 01 de maio","Data fixa","Lei 666, de 06/04/1949, art. 1º"]
[null,"Dia da Independência do Brasil - 07 de setembro","Data fixa","Lei 666, de 06/04/1949, art. 1º"]
[null,"Padroeira do Brasil - 12 de outubro","Data fixa","Lei 6.802, de 30.06.1980"]
[null,"Dia de eleições gerais","Data fixa","Lei 1.266, de 08/12/1950,art. 3º; Lei 662, de 06/04/1949, art. 1º"]
[null,"Dia de Finados - 02 de novembro","Data fixa","Lei 666, de 06/04/1949, art. 1º, com a redação dada pela Lei 10.607, de 19/12/2002"]
[null,"Proclamação da República","Data fixa","Lei 666, de 06/04/1949, art. 1º"]
[null,"Dia de Natal - 25 de dezembro","Data fixa","Lei 666, de 06/04/1949, art. 1º"]
[]
[{"$nulls":36},"Pdia","Udia"]
[{"$nulls":36},{"$f":"DATE(anno,MATCH($Q$3,NMês,0),1)","v":"2024-01-01"},{"$f":"DATE(anno,MATCH($M$3,Meses,0)+1,1)-1","v":"2024-01-31"}]
[{"$nulls":36},"Janeiro",1]
[{"$nulls":36},"Fevereiro",2]
[{"$nulls":36},"Março",3]
[{"$nulls":36},"Abril",4]
[{"$nulls":36},"Maio",5]
[{"$nulls":36},"Junho",6]
[{"$nulls":36},"Julho",7]
[{"$nulls":36},"Agosto",8]
[{"$nulls":36},"Setembro",9]
[{"$nulls":36},"Outubro",10]
[{"$nulls":36},"Novembro",11]
[{"$nulls":36},"Dezembro",12]
{"$rows_empty":36}
[null,null,true,{"$f":"IF(C100=TRUE,1,0)","v":1}]
[null,null,true,{"$f":"IF(C101=TRUE,1,0)","v":1}]
[null,null,false,{"$f":"IF(C102=TRUE,1,0)","v":0}]
{"$rows_empty":9}
[null,null,true]
[]
[]
[{"$nulls":54},"1905-01-03"]

{"sheet":"Links","index":3,"n_rows":35,"n_cols":2,"rows_kept":35}
[]
[]
[null,"LEGISLAÇÃO"]
[]
[null,"Constituição Federal, art. 7º, Inciso XXI - Aviso prévio proporcional"]
[]
[null,"CLT, arts. 487 a 491 - Aviso prévio"]
[]
[null,"Lei 12506, de 2011 - Aviso prévio proporcional"]
[]
[null,"JURISPRUDÊNCIA"]
[]
[null,"Súmula TST 163 - Contrato de experiência"]
[]
[null,"Súmula TST 182 - Indenização compensatória. Cômputo do tempo do aviso prévio"]
[]
[null,"Súmula TST 230 - Horas extras no período do aviso prévio"]
[]
[null,"Súmula TST 276 - Aviso prévio. Renúncia pelo empregado"]
[]
[null,"Súmula TST 305 - FGTS. Incidência sobre aviso prévio"]
[]
[null,"Súmula TST 348 - Aviso prévio. Concessão na fluência da garantia de emprego. Invalidade"]
[]
[null,"Súmula TST 371 - Aviso prévio indenizado. Efeitos. Superveniência de auxílio-doença no curso deste"]
[]
[null,"Súmula TST 380 - Aviso prévio. Início da contagem"]
[]
[null,"Súmula TST 441 - Aviso prévio. Proporcionalidade"]
[]
[null,"Orientação Jurisprudencial SDI1 014 - Aviso prévio cumprido em casa. Prazo para pagamento"]
[]
[null,"Orientação Jurisprudencial SDI1 082 - Aviso prévio. Baixa na CTPS"]
[]
[null,"Orientação Jurisprudencial SDI1 367 - Aviso prévio 60 dias. Elastecimento por norma coletiva. Reflexos nas parcelas trabalhistas"]

{"sheet":"Aliq_INSS","index":4,"n_rows":664,"n_cols":18,"rows_kept":664,"merged":[[0,0,0,11],[0,12,0,14],[2,9,2,11],[2,12,2,14],[3,12,3,14]]}
["INSS"]
[]
["Época","Faixa Mínima","Alíquota","Faixa Média","Alíquota","Faixa Maior","Alíquota","Faixa Máxima","Alíquota","Limite de Contribuição",null,null,"Parcelas a Deduzir"]
["mês/ano","até","%","até","%","até","%","até","%","até","%","TETO","$"]
["1970-01-01",{"v":1560,"d":"1,560.00"},{"v":0.08,"d":"8%"},{"v":1560,"d":"1,560.00"},{"v":0.08,"d":"8%"},{"v":1560,"d":"1,560.00"},{"v":0.08,"d":"8%"},{"v":1560,"d":"1,560.00"},{"v":0.08,"d":"8%"},{"v":1560,"d":"1,560.00"},{"v":0.08,"d":"8%"},{"v":124.8,"d":"124.80"}]
["1970-02-01",{"v":1560,"d":"1,560.00"},{"v":0.08,"d":"8%"},{"v":1560,"d":"1,560.00"},{"v":0.08,"d":"8%"},{"v":1560,"d":"1,560.00"},{"v":0.08,"d":"8%"},{"v":1560,"d":"1,560.00"},{"v":0.08,"d":"8%"},{"v":1560,"d":"1,560.00"},{"v":0.08,"d":"8%"},{"v":124.8,"d":"124.80"}]
["1970-03-01",{"v":1560,"d":"1,560.00"},{"v":0.08,"d":"8%"},{"v":1560,"d":"1,560.00"},{"v":0.08,"d":"8%"},{"v":1560,"d":"1,560.00"},{"v":0.08,"d":"8%"},{"v":1560,"d":"1,560.00"},{"v":0.08,"d":"8%"},{"v":1560,"d":"1,560.00"},{"v":0.08,"d":"8%"},{"v":124.8,"d":"124.80"}]
["1970-04-01",{"v":1560,"d":"1,560.00"},{"v":0.08,"d":"8%"},{"v":1560,"d":"1,560.00"},{"v":0.08,"d":"8%"},{"v":1560,"d":"1,560.00"},{"v":0.08,"d":"8%"},{"v":1560,"d":"1,560.00"},{"v":0.08,"d":"8%"},{"v":1560,"d":"1,560.00"},{"v":0.08,"d":"8%"},{"v":124.8,"d":"124.80"}]
["1970-05-01",{"v":1872,"d":"1,872.00"},{"v":0.08,"d":"8%"},{"v":1872,"d":"1,872.00"},{"v":0.08,"d":"8%"},{"v":1872,"d":"1,872.00"},{"v":0.08,"d":"8%"},{"v":1872,"d":"1,872.00"},{"v":0.08,"d":"8%"},{"v":1872,"d":"1,872.00"},{"v":0.08,"d":"8%"},149.76]
["1970-06-01",{"v":1872,"d":"1,872.00"},{"v":0.08,"d":"8%"},{"v":1872,"d":"1,872.00"},{"v":0.08,"d":"8%"},{"v":1872,"d":"1,872.00"},{"v":0.08,"d":"8%"},{"v":1872,"d":"1,872.00"},{"v":0.08,"d":"8%"},{"v":1872,"d":"1,872.00"},{"v":0.08,"d":"8%"},149.76]
["1970-07-01",{"v":1872,"d":"1,872.00"},{"v":0.08,"d":"8%"},{"v":1872,"d":"1,872.00"},{"v":0.08,"d":"8%"},{"v":1872,"d":"1,872.00"},{"v":0.08,"d":"8%"},{"v":1872,"d":"1,872.00"},{"v":0.08,"d":"8%"},{"v":1872,"d":"1,872.00"},{"v":0.08,"d":"8%"},149.76]
["1970-08-01",{"v":1872,"d":"1,872.00"},{"v":0.08,"d":"8%"},{"v":1872,"d":"1,872.00"},{"v":0.08,"d":"8%"},{"v":1872,"d":"1,872.00"},{"v":0.08,"d":"8%"},{"v":1872,"d":"1,872.00"},{"v":0.08,"d":"8%"},{"v":1872,"d":"1,872.00"},{"v":0.08,"d":"8%"},149.76]
["1970-09-01",{"v":1872,"d":"1,872.00"},{"v":0.08,"d":"8%"},{"v":1872,"d":"1,872.00"},{"v":0.08,"d":"8%"},{"v":1872,"d":"1,872.00"},{"v":0.08,"d":"8%"},{"v":1872,"d":"1,872.00"},{"v":0.08,"d":"8%"},{"v":1872,"d":"1,872.00"},{"v":0.08,"d":"8%"},149.76]
["1970-10-01",{"v":1872,"d":"1,872.00"},{"v":0.08,"d":"8%"},{"v":1872,"d":"1,872.00"},{"v":0.08,"d":"8%"},{"v":1872,"d":"1,872.00"},{"v":0.08,"d":"8%"},{"v":1872,"d":"1,872.00"},{"v":0.08,"d":"8%"},{"v":1872,"d":"1,872.00"},{"v":0.08,"d":"8%"},149.76]
["1970-11-01",{"v":1872,"d":"1,872.00"},{"v":0.08,"d":"8%"},{"v":1872,"d":"1,872.00"},{"v":0.08,"d":"8%"},{"v":1872,"d":"1,872.00"},{"v":0.08,"d":"8%"},{"v":1872,"d":"1,872.00"},{"v":0.08,"d":"8%"},{"v":1872,"d":"1,872.00"},{"v":0.08,"d":"8%"},149.76]
["1970-12-01",{"v":1872,"d":"1,872.00"},{"v":0.08,"d":"8%"},{"v":1872,"d":"1,872.00"},{"v":0.08,"d":"8%"},{"v":1872,"d":"1,872.00"},{"v":0.08,"d":"8%"},{"v":1872,"d":"1,872.00"},{"v":0.08,"d":"8%"},{"v":1872,"d":"1,872.00"},{"v":0.08,"d":"8%"},149.76]
["1971-01-01",{"v":1872,"d":"1,872.00"},{"v":0.08,"d":"8%"},{"v":1872,"d":"1,872.00"},{"v":0.08,"d":"8%"},{"v":1872,"d":"1,872.00"},{"v":0.08,"d":"8%"},{"v":1872,"d":"1,872.00"},{"v":0.08,"d":"8%"},{"v":1872,"d":"1,872.00"},{"v":0.08,"d":"8%"},149.76]
["1971-02-01",{"v":1872,"d":"1,872.00"},{"v":0.08,"d":"8%"},{"v":1872,"d":"1,872.00"},{"v":0.08,"d":"8%"},{"v":1872,"d":"1,872.00"},{"v":0.08,"d":"8%"},{"v":1872,"d":"1,872.00"},{"v":0.08,"d":"8%"},{"v":1872,"d":"1,872.00"},{"v":0.08,"d":"8%"},149.76]
["1971-03-01",{"v":1872,"d":"1,872.00"},{"v":0.08,"d":"8%"},{"v":1872,"d":"1,872.00"},{"v":0.08,"d":"8%"},{"v":1872,"d":"1,872.00"},{"v":0.08,"d":"8%"},{"v":1872,"d":"1,872.00"},{"v":0.08,"d":"8%"},{"v":1872,"d":"1,872.00"},{"v":0.08,"d":"8%"},149.76]
["1971-04-01",{"v":1872,"d":"1,872.00"},{"v":0.08,"d":"8%"},{"v":1872,"d":"1,872.00"},{"v":0.08,"d":"8%"},{"v":1872,"d":"1,872.00"},{"v":0.08,"d":"8%"},{"v":1872,"d":"1,872.00"},{"v":0.08,"d":"8%"},{"v":1872,"d":"1,872.00"},{"v":0.08,"d":"8%"},149.76]
["1971-05-01",{"v":2562,"d":"2,562.00"},{"v":0.08,"d":"8%"},{"v":2562,"d":"2,562.00"},{"v":0.08,"d":"8%"},{"v":2562,"d":"2,562.00"},{"v":0.08,"d":"8%"},{"v":2562,"d":"2,562.00"},{"v":0.08,"d":"8%"},{"v":2562,"d":"2,562.00"},{"v":0.08,"d":"8%"},204.96]
["1971-06-01",{"v":2562,"d":"2,562.00"},{"v":0.08,"d":"8%"},{"v":2562,"d":"2,562.00"},{"v":0.08,"d":"8%"},{"v":2562,"d":"2,562.00"},{"v":0.08,"d":"8%"},{"v":2562,"d":"2,562.00"},{"v":0.08,"d":"8%"},{"v":2562,"d":"2,562.00"},{"v":0.08,"d":"8%"},204.96]
["1971-07-01",{"v":2562,"d":"2,562.00"},{"v":0.08,"d":"8%"},{"v":2562,"d":"2,562.00"},{"v":0.08,"d":"8%"},{"v":2562,"d":"2,562.00"},{"v":0.08,"d":"8%"},{"v":2562,"d":"2,562.00"},{"v":0.08,"d":"8%"},{"v":2562,"d":"2,562.00"},{"v":0.08,"d":"8%"},204.96]
["1971-08-01",{"v":2562,"d":"2,562.00"},{"v":0.08,"d":"8%"},{"v":2562,"d":"2,562.00"},{"v":0.08,"d":"8%"},{"v":2562,"d":"2,562.00"},{"v":0.08,"d":"8%"},{"v":2562,"d":"2,562.00"},{"v":0.08,"d":"8%"},{"v":2562,"d":"2,562.00"},{"v":0.08,"d":"8%"},204.96]
["1971-09-01",{"v":2562,"d":"2,562.00"},{"v":0.08,"d":"8%"},{"v":2562,"d":"2,562.00"},{"v":0.08,"d":"8%"},{"v":2562,"d":"2,562.00"},{"v":0.08,"d":"8%"},{"v":2562,"d":"2,562.00"},{"v":0.08,"d":"8%"},{"v":2562,"d":"2,562.00"},{"v":0.08,"d":"8%"},204.96]
["1971-10-01",{"v":2562,"d":"2,562.00"},{"v":0.08,"d":"8%"},{"v":2562,"d":"2,562.00"},{"v":0.08,"d":"8%"},{"v":2562,"d":"2,562.00"},{"v":0.08,"d":"8%"},{"v":2562,"d":"2,562.00"},{"v":0.08,"d":"8%"},{"v":2562,"d":"2,562.00"},{"v":0.08,"d":"8%"},204.96]
["1971-11-01",{"v":2562,"d":"2,562.00"},{"v":0.08,"d":"8%"},{"v":2562,"d":"2,562.00"},{"v":0.08,"d":"8%"},{"v":2562,"d":"2,562.00"},{"v":0.08,"d":"8%"},{"v":2562,"d":"2,562.00"},{"v":0.08,"d":"8%"},{"v":2562,"d":"2,562.00"},{"v":0.08,"d":"8%"},204.96]
["1971-12-01",{"v":2562,"d":"2,562.00"},{"v":0.08,"d":"8%"},{"v":2562,"d":"2,562.00"},{"v":0.08,"d":"8%"},{"v":2562,"d":"2,562.00"},{"v":0.08,"d":"8%"},{"v":2562,"d":"2,562.00"},{"v":0.08,"d":"8%"},{"v":2562,"d":"2,562.00"},{"v":0.08,"d":"8%"},204.96]
["1972-01-01",{"v":2562,"d":"2,562.00"},{"v":0.08,"d":"8%"},{"v":2562,"d":"2,562.00"},{"v":0.08,"d":"8%"},{"v":2562,"d":"2,562.00"},{"v":0.08,"d":"8%"},{"v":2562,"d":"2,562.00"},{"v":0.08,"d":"8%"},{"v":2562,"d":"2,562.00"},{"v":0.08,"d":"8%"},204.96]
["1972-02-01",{"v":2562,"d":"2,562.00"},{"v":0.08,"d":"8%"},{"v":2562,"d":"2,562.00"},{"v":0.08,"d":"8%"},{"v":2562,"d":"2,562.00"},{"v":0.08,"d":"8%"},{"v":2562,"d":"2,562.00"},{"v":0.08,"d":"8%"},{"v":2562,"d":"2,562.00"},{"v":0.08,"d":"8%"},204.96]
["1972-03-01",{"v":2562,"d":"2,562.00"},{"v":0.08,"d":"8%"},{"v":2562,"d":"2,562.00"},{"v":0.08,"d":"8%"},{"v":2562,"d":"2,562.00"},{"v":0.08,"d":"8%"},{"v":2562,"d":"2,562.00"},{"v":0.08,"d":"8%"},{"v":2562,"d":"2,562.00"},{"v":0.08,"d":"8%"},204.96]
["1972-04-01",{"v":2562,"d":"2,562.00"},{"v":0.08,"d":"8%"},{"v":2562,"d":"2,562.00"},{"v":0.08,"d":"8%"},{"v":2562,"d":"2,562.00"},{"v":0.08,"d":"8%"},{"v":2562,"d":"2,562.00"},{"v":0.08,"d":"8%"},{"v":2562,"d":"2,562.00"},{"v":0.08,"d":"8%"},204.96]
["1972-05-01",{"v":2688,"d":"2,688.00"},{"v":0.08,"d":"8%"},{"v":2688,"d":"2,688.00"},{"v":0.08,"d":"8%"},{"v":2688,"d":"2,688.00"},{"v":0.08,"d":"8%"},{"v":2688,"d":"2,688.00"},{"v":0.08,"d":"8%"},{"v":2688,"d":"2,688.00"},{"v":0.08,"d":"8%"},215.04]
["1972-06-01",{"v":2688,"d":"2,688.00"},{"v":0.08,"d":"8%"},{"v":2688,"d":"2,688.00"},{"v":0.08,"d":"8%"},{"v":2688,"d":"2,688.00"},{"v":0.08,"d":"8%"},{"v":2688,"d":"2,688.00"},{"v":0.08,"d":"8%"},{"v":2688,"d":"2,688.00"},{"v":0.08,"d":"8%"},215.04]
["1972-07-01",{"v":2688,"d":"2,688.00"},{"v":0.08,"d":"8%"},{"v":2688,"d":"2,688.00"},{"v":0.08,"d":"8%"},{"v":2688,"d":"2,688.00"},{"v":0.08,"d":"8%"},{"v":2688,"d":"2,688.00"},{"v":0.08,"d":"8%"},{"v":2688,"d":"2,688.00"},{"v":0.08,"d":"8%"},215.04]
["1972-08-01",{"v":2688,"d":"2,688.00"},{"v":0.08,"d":"8%"},{"v":2688,"d":"2,688.00"},{"v":0.08,"d":"8%"},{"v":2688,"d":"2,688.00"},{"v":0.08,"d":"8%"},{"v":2688,"d":"2,688.00"},{"v":0.08,"d":"8%"},{"v":2688,"d":"2,688.00"},{"v":0.08,"d":"8%"},215.04]
["1972-09-01",{"v":2688,"d":"2,688.00"},{"v":0.08,"d":"8%"},{"v":2688,"d":"2,688.00"},{"v":0.08,"d":"8%"},{"v":2688,"d":"2,688.00"},{"v":0.08,"d":"8%"},{"v":2688,"d":"2,688.00"},{"v":0.08,"d":"8%"},{"v":2688,"d":"2,688.00"},{"v":0.08,"d":"8%"},215.04]
["1972-10-01",{"v":2688,"d":"2,688.00"},{"v":0.08,"d":"8%"},{"v":2688,"d":"2,688.00"},{"v":0.08,"d":"8%"},{"v":2688,"d":"2,688.00"},{"v":0.08,"d":"8%"},{"v":2688,"d":"2,688.00"},{"v":0.08,"d":"8%"},{"v":2688,"d":"2,688.00"},{"v":0.08,"d":"8%"},215.04]
["1972-11-01",{"v":2688,"d":"2,688.00"},{"v":0.08,"d":"8%"},{"v":2688,"d":"2,688.00"},{"v":0.08,"d":"8%"},{"v":2688,"d":"2,688.00"},{"v":0.08,"d":"8%"},{"v":2688,"d":"2,688.00"},{"v":0.08,"d":"8%"},{"v":2688,"d":"2,688.00"},{"v":0.08,"d":"8%"},215.04]
["1972-12-01",{"v":2688,"d":"2,688.00"},{"v":0.08,"d":"8%"},{"v":2688,"d":"2,688.00"},{"v":0.08,"d":"8%"},{"v":2688,"d":"2,688.00"},{"v":0.08,"d":"8%"},{"v":2688,"d":"2,688.00"},{"v":0.08,"d":"8%"},{"v":2688,"d":"2,688.00"},{"v":0.08,"d":"8%"},215.04]
["1973-01-01",{"v":2688,"d":"2,688.00"},{"v":0.08,"d":"8%"},{"v":2688,"d":"2,688.00"},{"v":0.08,"d":"8%"},{"v":2688,"d":"2,688.00"},{"v":0.08,"d":"8%"},{"v":2688,"d":"2,688.00"},{"v":0.08,"d":"8%"},{"v":2688,"d":"2,688.00"},{"v":0.08,"d":"8%"},215.04]
["1973-02-01",{"v":2688,"d":"2,688.00"},{"v":0.08,"d":"8%"},{"v":2688,"d":"2,688.00"},{"v":0.08,"d":"8%"},{"v":2688,"d":"2,688.00"},{"v":0.08,"d":"8%"},{"v":2688,"d":"2,688.00"},{"v":0.08,"d":"8%"},{"v":2688,"d":"2,688.00"},{"v":0.08,"d":"8%"},215.04]
["1973-03-01",{"v":2688,"d":"2,688.00"},{"v":0.08,"d":"8%"},{"v":2688,"d":"2,688.00"},{"v":0.08,"d":"8%"},{"v":2688,"d":"2,688.00"},{"v":0.08,"d":"8%"},{"v":2688,"d":"2,688.00"},{"v":0.08,"d":"8%"},{"v":2688,"d":"2,688.00"},{"v":0.08,"d":"8%"},215.04]
["1973-04-01",{"v":2688,"d":"2,688.00"},{"v":0.08,"d":"8%"},{"v":2688,"d":"2,688.00"},{"v":0.08,"d":"8%"},{"v":2688,"d":"2,688.00"},{"v":0.08,"d":"8%"},{"v":2688,"d":"2,688.00"},{"v":0.08,"d":"8%"},{"v":2688,"d":"2,688.00"},{"v":0.08,"d":"8%"},215.04]
["1973-05-01",{"v":3120,"d":"3,120.00"},{"v":0.08,"d":"8%"},{"v":3120,"d":"3,120.00"},{"v":0.08,"d":"8%"},{"v":3120,"d":"3,120.00"},{"v":0.08,"d":"8%"},{"v":3120,"d":"3,120.00"},{"v":0.08,"d":"8%"},{"v":3120,"d":"3,120.00"},{"v":0.08,"d":"8%"},{"v":249.6,"d":"249.60"}]
["1973-06-01",{"v":5200,"d":"5,200.00"},{"v":0.08,"d":"8%"},{"v":5200,"d":"5,200.00"},{"v":0.08,"d":"8%"},{"v":5200,"d":"5,200.00"},{"v":0.08,"d":"8%"},{"v":5200,"d":"5,200.00"},{"v":0.08,"d":"8%"},{"v":5200,"d":"5,200.00"},{"v":0.08,"d":"8%"},{"v":416,"d":"416.00"}]
["1973-07-01",{"v":6240,"d":"6,240.00"},{"v":0.08,"d":"8%"},{"v":6240,"d":"6,240.00"},{"v":0.08,"d":"8%"},{"v":6240,"d":"6,240.00"},{"v":0.08,"d":"8%"},{"v":6240,"d":"6,240.00"},{"v":0.08,"d":"8%"},{"v":6240,"d":"6,240.00"},{"v":0.08,"d":"8%"},{"v":499.2,"d":"499.20"}]
["1973-08-01",{"v":6240,"d":"6,240.00"},{"v":0.08,"d":"8%"},{"v":6240,"d":"6,240.00"},{"v":0.08,"d":"8%"},{"v":6240,"d":"6,240.00"},{"v":0.08,"d":"8%"},{"v":6240,"d":"6,240.00"},{"v":0.08,"d":"8%"},{"v":6240,"d":"6,240.00"},{"v":0.08,"d":"8%"},{"v":499.2,"d":"499.20"}]
["1973-09-01",{"v":6240,"d":"6,240.00"},{"v":0.08,"d":"8%"},{"v":6240,"d":"6,240.00"},{"v":0.08,"d":"8%"},{"v":6240,"d":"6,240.00"},{"v":0.08,"d":"8%"},{"v":6240,"d":"6,240.00"},{"v":0.08,"d":"8%"},{"v":6240,"d":"6,240.00"},{"v":0.08,"d":"8%"},{"v":499.2,"d":"499.20"}]
["1973-10-01",{"v":6240,"d":"6,240.00"},{"v":0.08,"d":"8%"},{"v":6240,"d":"6,240.00"},{"v":0.08,"d":"8%"},{"v":6240,"d":"6,240.00"},{"v":0.08,"d":"8%"},{"v":6240,"d":"6,240.00"},{"v":0.08,"d":"8%"},{"v":6240,"d":"6,240.00"},{"v":0.08,"d":"8%"},{"v":499.2,"d":"499.20"}]
["1973-11-01",{"v":6240,"d":"6,240.00"},{"v":0.08,"d":"8%"},{"v":6240,"d":"6,240.00"},{"v":0.08,"d":"8%"},{"v":6240,"d":"6,240.00"},{"v":0.08,"d":"8%"},{"v":6240,"d":"6,240.00"},{"v":0.08,"d":"8%"},{"v":6240,"d":"6,240.00"},{"v":0.08,"d":"8%"},{"v":499.2,"d":"499.20"}]
["1973-12-01",{"v":6240,"d":"6,240.00"},{"v":0.08,"d":"8%"},{"v":6240,"d":"6,240.00"},{"v":0.08,"d":"8%"},{"v":6240,"d":"6,240.00"},{"v":0.08,"d":"8%"},{"v":6240,"d":"6,240.00"},{"v":0.08,"d":"8%"},{"v":6240,"d":"6,240.00"},{"v":0.08,"d":"8%"},{"v":499.2,"d":"499.20"}]
["1974-01-01",{"v":6240,"d":"6,240.00"},{"v":0.08,"d":"8%"},{"v":6240,"d":"6,240.00"},{"v":0.08,"d":"8%"},{"v":6240,"d":"6,240.00"},{"v":0.08,"d":"8%"},{"v":6240,"d":"6,240.00"},{"v":0.08,"d":"8%"},{"v":6240,"d":"6,240.00"},{"v":0.08,"d":"8%"},{"v":499.2,"d":"499.20"}]
["1974-02-01",{"v":6240,"d":"6,240.00"},{"v":0.08,"d":"8%"},{"v":6240,"d":"6,240.00"},{"v":0.08,"d":"8%"},{"v":6240,"d":"6,240.00"},{"v":0.08,"d":"8%"},{"v":6240,"d":"6,240.00"},{"v":0.08,"d":"8%"},{"v":6240,"d":"6,240.00"},{"v":0.08,"d":"8%"},{"v":499.2,"d":"499.20"}]
["1974-03-01",{"v":6240,"d":"6,240.00"},{"v":0.08,"d":"8%"},{"v":6240,"d":"6,240.00"},{"v":0.08,"d":"8%"},{"v":6240,"d":"6,240.00"},{"v":0.08,"d":"8%"},{"v":6240,"d":"6,240.00"},{"v":0.08,"d":"8%"},{"v":6240,"d":"6,240.00"},{"v":0.08,"d":"8%"},{"v":499.2,"d":"499.20"}]
["1974-04-01",{"v":6240,"d":"6,240.00"},{"v":0.08,"d":"8%"},{"v":6240,"d":"6,240.00"},{"v":0.08,"d":"8%"},{"v":6240,"d":"6,240.00"},{"v":0.08,"d":"8%"},{"v":6240,"d":"6,240.00"},{"v":0.08,"d":"8%"},{"v":6240,"d":"6,240.00"},{"v":0.08,"d":"8%"},{"v":499.2,"d":"499.20"}]
["1974-05-01",{"v":7536,"d":"7,536.00"},{"v":0.08,"d":"8%"},{"v":7536,"d":"7,536.00"},{"v":0.08,"d":"8%"},{"v":7536,"d":"7,536.00"},{"v":0.08,"d":"8%"},{"v":7536,"d":"7,536.00"},{"v":0.08,"d":"8%"},{"v":7536,"d":"7,536.00"},{"v":0.08,"d":"8%"},602.88]
["1974-06-01",{"v":7536,"d":"7,536.00"},{"v":0.08,"d":"8%"},{"v":7536,"d":"7,536.00"},{"v":0.08,"d":"8%"},{"v":7536,"d":"7,536.00"},{"v":0.08,"d":"8%"},{"v":7536,"d":"7,536.00"},{"v":0.08,"d":"8%"},{"v":7536,"d":"7,536.00"},{"v":0.08,"d":"8%"},602.88]
["1974-07-01",{"v":7536,"d":"7,536.00"},{"v":0.08,"d":"8%"},{"v":7536,"d":"7,536.00"},{"v":0.08,"d":"8%"},{"v":7536,"d":"7,536.00"},{"v":0.08,"d":"8%"},{"v":7536,"d":"7,536.00"},{"v":0.08,"d":"8%"},{"v":7536,"d":"7,536.00"},{"v":0.08,"d":"8%"},602.88]
["1974-08-01",{"v":7536,"d":"7,536.00"},{"v":0.08,"d":"8%"},{"v":7536,"d":"7,536.00"},{"v":0.08,"d":"8%"},{"v":7536,"d":"7,536.00"},{"v":0.08,"d":"8%"},{"v":7536,"d":"7,536.00"},{"v":0.08,"d":"8%"},{"v":7536,"d":"7,536.00"},{"v":0.08,"d":"8%"},602.88]
["1974-09-01",{"v":7536,"d":"7,536.00"},{"v":0.08,"d":"8%"},{"v":7536,"d":"7,536.00"},{"v":0.08,"d":"8%"},{"v":7536,"d":"7,536.00"},{"v":0.08,"d":"8%"},{"v":7536,"d":"7,536.00"},{"v":0.08,"d":"8%"},{"v":7536,"d":"7,536.00"},{"v":0.08,"d":"8%"},602.88]
["1974-10-01",{"v":7536,"d":"7,536.00"},{"v":0.08,"d":"8%"},{"v":7536,"d":"7,536.00"},{"v":0.08,"d":"8%"},{"v":7536,"d":"7,536.00"},{"v":0.08,"d":"8%"},{"v":7536,"d":"7,536.00"},{"v":0.08,"d":"8%"},{"v":7536,"d":"7,536.00"},{"v":0.08,"d":"8%"},602.88]
["1974-11-01",{"v":7536,"d":"7,536.00"},{"v":0.08,"d":"8%"},{"v":7536,"d":"7,536.00"},{"v":0.08,"d":"8%"},{"v":7536,"d":"7,536.00"},{"v":0.08,"d":"8%"},{"v":7536,"d":"7,536.00"},{"v":0.08,"d":"8%"},{"v":7536,"d":"7,536.00"},{"v":0.08,"d":"8%"},602.88]
["1974-12-01",{"v":7536,"d":"7,536.00"},{"v":0.08,"d":"8%"},{"v":7536,"d":"7,536.00"},{"v":0.08,"d":"8%"},{"v":7536,"d":"7,536.00"},{"v":0.08,"d":"8%"},{"v":7536,"d":"7,536.00"},{"v":0.08,"d":"8%"},{"v":7536,"d":"7,536.00"},{"v":0.08,"d":"8%"},602.88]
["1975-01-01",{"v":7536,"d":"7,536.00"},{"v":0.08,"d":"8%"},{"v":7536,"d":"7,536.00"},{"v":0.08,"d":"8%"},{"v":7536,"d":"7,536.00"},{"v":0.08,"d":"8%"},{"v":7536,"d":"7,536.00"},{"v":0.08,"d":"8%"},{"v":7536,"d":"7,536.00"},{"v":0.08,"d":"8%"},602.88]
["1975-02-01",{"v":7536,"d":"7,536.00"},{"v":0.08,"d":"8%"},{"v":7536,"d":"7,536.00"},{"v":0.08,"d":"8%"},{"v":7536,"d":"7,536.00"},{"v":0.08,"d":"8%"},{"v":7536,"d":"7,536.00"},{"v":0.08,"d":"8%"},{"v":7536,"d":"7,536.00"},{"v":0.08,"d":"8%"},602.88]
["1975-03-01",{"v":7536,"d":"7,536.00"},{"v":0.08,"d":"8%"},{"v":7536,"d":"7,536.00"},{"v":0.08,"d":"8%"},{"v":7536,"d":"7,536.00"},{"v":0.08,"d":"8%"},{"v":7536,"d":"7,536.00"},{"v":0.08,"d":"8%"},{"v":7536,"d":"7,536.00"},{"v":0.08,"d":"8%"},602.88]
["1975-04-01",{"v":7536,"d":"7,536.00"},{"v":0.08,"d":"8%"},{"v":7536,"d":"7,536.00"},{"v":0.08,"d":"8%"},{"v":7536,"d":"7,536.00"},{"v":0.08,"d":"8%"},{"v":7536,"d":"7,536.00"},{"v":0.08,"d":"8%"},{"v":7536,"d":"7,536.00"},{"v":0.08,"d":"8%"},602.88]
["1975-05-01",{"v":10020,"d":"10,020.00"},{"v":0.08,"d":"8%"},{"v":10020,"d":"10,020.00"},{"v":0.08,"d":"8%"},{"v":10020,"d":"10,020.00"},{"v":0.08,"d":"8%"},{"v":10020,"d":"10,020.00"},{"v":0.08,"d":"8%"},{"v":10020,"d":"10,020.00"},{"v":0.08,"d":"8%"},{"v":801.6,"d":"801.60"}]
["1975-06-01",{"v":10020,"d":"10,020.00"},{"v":0.08,"d":"8%"},{"v":10020,"d":"10,020.00"},{"v":0.08,"d":"8%"},{"v":10020,"d":"10,020.00"},{"v":0.08,"d":"8%"},{"v":10020,"d":"10,020.00"},{"v":0.08,"d":"8%"},{"v":10020,"d":"10,020.00"},{"v":0.08,"d":"8%"},{"v":801.6,"d":"801.60"}]
["1975-07-01",{"v":10020,"d":"10,020.00"},{"v":0.08,"d":"8%"},{"v":10020,"d":"10,020.00"},{"v":0.08,"d":"8%"},{"v":10020,"d":"10,020.00"},{"v":0.08,"d":"8%"},{"v":10020,"d":"10,020.00"},{"v":0.08,"d":"8%"},{"v":10020,"d":"10,020.00"},{"v":0.08,"d":"8%"},{"v":801.6,"d":"801.60"}]
["1975-08-01",{"v":10020,"d":"10,020.00"},{"v":0.08,"d":"8%"},{"v":10020,"d":"10,020.00"},{"v":0.08,"d":"8%"},{"v":10020,"d":"10,020.00"},{"v":0.08,"d":"8%"},{"v":10020,"d":"10,020.00"},{"v":0.08,"d":"8%"},{"v":10020,"d":"10,020.00"},{"v":0.08,"d":"8%"},{"v":801.6,"d":"801.60"}]
["1975-09-01",{"v":10020,"d":"10,020.00"},{"v":0.08,"d":"8%"},{"v":10020,"d":"10,020.00"},{"v":0.08,"d":"8%"},{"v":10020,"d":"10,020.00"},{"v":0.08,"d":"8%"},{"v":10020,"d":"10,020.00"},{"v":0.08,"d":"8%"},{"v":10020,"d":"10,020.00"},{"v":0.08,"d":"8%"},{"v":801.6,"d":"801.60"}]
["1975-10-01",{"v":10020,"d":"10,020.00"},{"v":0.08,"d":"8%"},{"v":10020,"d":"10,020.00"},{"v":0.08,"d":"8%"},{"v":10020,"d":"10,020.00"},{"v":0.08,"d":"8%"},{"v":10020,"d":"10,020.00"},{"v":0.08,"d":"8%"},{"v":10020,"d":"10,020.00"},{"v":0.08,"d":"8%"},{"v":801.6,"d":"801.60"}]
["1975-11-01",{"v":10020,"d":"10,020.00"},{"v":0.08,"d":"8%"},{"v":10020,"d":"10,020.00"},{"v":0.08,"d":"8%"},{"v":10020,"d":"10,020.00"},{"v":0.08,"d":"8%"},{"v":10020,"d":"10,020.00"},{"v":0.08,"d":"8%"},{"v":10020,"d":"10,020.00"},{"v":0.08,"d":"8%"},{"v":801.6,"d":"801.60"}]
["1975-12-01",{"v":10020,"d":"10,020.00"},{"v":0.08,"d":"8%"},{"v":10020,"d":"10,020.00"},{"v":0.08,"d":"8%"},{"v":10020,"d":"10,020.00"},{"v":0.08,"d":"8%"},{"v":10020,"d":"10,020.00"},{"v":0.08,"d":"8%"},{"v":10020,"d":"10,020.00"},{"v":0.08,"d":"8%"},{"v":801.6,"d":"801.60"}]
["1976-01-01",{"v":10020,"d":"10,020.00"},{"v":0.08,"d":"8%"},{"v":10020,"d":"10,020.00"},{"v":0.08,"d":"8%"},{"v":10020,"d":"10,020.00"},{"v":0.08,"d":"8%"},{"v":10020,"d":"10,020.00"},{"v":0.08,"d":"8%"},{"v":10020,"d":"10,020.00"},{"v":0.08,"d":"8%"},{"v":801.6,"d":"801.60"}]
["1976-02-01",{"v":10020,"d":"10,020.00"},{"v":0.08,"d":"8%"},{"v":10020,"d":"10,020.00"},{"v":0.08,"d":"8%"},{"v":10020,"d":"10,020.00"},{"v":0.08,"d":"8%"},{"v":10020,"d":"10,020.00"},{"v":0.08,"d":"8%"},{"v":10020,"d":"10,020.00"},{"v":0.08,"d":"8%"},{"v":801.6,"d":"801.60"}]
["1976-03-01",{"v":10020,"d":"10,020.00"},{"v":0.08,"d":"8%"},{"v":10020,"d":"10,020.00"},{"v":0.08,"d":"8%"},{"v":10020,"d":"10,020.00"},{"v":0.08,"d":"8%"},{"v":10020,"d":"10,020.00"},{"v":0.08,"d":"8%"},{"v":10020,"d":"10,020.00"},{"v":0.08,"d":"8%"},{"v":801.6,"d":"801.60"}]
["1976-04-01",{"v":10020,"d":"10,020.00"},{"v":0.08,"d":"8%"},{"v":10020,"d":"10,020.00"},{"v":0.08,"d":"8%"},{"v":10020,"d":"10,020.00"},{"v":0.08,"d":"8%"},{"v":10020,"d":"10,020.00"},{"v":0.08,"d":"8%"},{"v":10020,"d":"10,020.00"},{"v":0.08,"d":"8%"},{"v":801.6,"d":"801.60"}]
["1976-05-01",{"v":12766,"d":"12,766.00"},{"v":0.08,"d":"8%"},{"v":12766,"d":"12,766.00"},{"v":0.08,"d":"8%"},{"v":12766,"d":"12,766.00"},{"v":0.08,"d":"8%"},{"v":12766,"d":"12,766.00"},{"v":0.08,"d":"8%"},{"v":12766,"d":"12,766.00"},{"v":0.08,"d":"8%"},{"v":1021.28,"d":"1,021.28"}]
["1976-06-01",{"v":14872,"d":"14,872.00"},{"v":0.08,"d":"8%"},{"v":14872,"d":"14,872.00"},{"v":0.08,"d":"8%"},{"v":14872,"d":"14,872.00"},{"v":0.08,"d":"8%"},{"v":14872,"d":"14,872.00"},{"v":0.08,"d":"8%"},{"v":14872,"d":"14,872.00"},{"v":0.08,"d":"8%"},{"v":1189.76,"d":"1,189.76"}]
["1976-07-01",{"v":14872,"d":"14,872.00"},{"v":0.08,"d":"8%"},{"v":14872,"d":"14,872.00"},{"v":0.08,"d":"8%"},{"v":14872,"d":"14,872.00"},{"v":0.08,"d":"8%"},{"v":14872,"d":"14,872.00"},{"v":0.08,"d":"8%"},{"v":14872,"d":"14,872.00"},{"v":0.08,"d":"8%"},{"v":1189.76,"d":"1,189.76"}]
["1976-08-01",{"v":14872,"d":"14,872.00"},{"v":0.08,"d":"8%"},{"v":14872,"d":"14,872.00"},{"v":0.08,"d":"8%"},{"v":14872,"d":"14,872.00"},{"v":0.08,"d":"8%"},{"v":14872,"d":"14,872.00"},{"v":0.08,"d":"8%"},{"v":14872,"d":"14,872.00"},{"v":0.08,"d":"8%"},{"v":1189.76,"d":"1,189.76"}]
["1976-09-01",{"v":14872,"d":"14,872.00"},{"v":0.08,"d":"8%"},{"v":14872,"d":"14,872.00"},{"v":0.08,"d":"8%"},{"v":14872,"d":"14,872.00"},{"v":0.08,"d":"8%"},{"v":14872,"d":"14,872.00"},{"v":0.08,"d":"8%"},{"v":14872,"d":"14,872.00"},{"v":0.08,"d":"8%"},{"v":1189.76,"d":"1,189.76"}]
["1976-10-01",{"v":14872,"d":"14,872.00"},{"v":0.08,"d":"8%"},{"v":14872,"d":"14,872.00"},{"v":0.08,"d":"8%"},{"v":14872,"d":"14,872.00"},{"v":0.08,"d":"8%"},{"v":14872,"d":"14,872.00"},{"v":0.08,"d":"8%"},{"v":14872,"d":"14,872.00"},{"v":0.08,"d":"8%"},{"v":1189.76,"d":"1,189.76"}]
["1976-11-01",{"v":14872,"d":"14,872.00"},{"v":0.08,"d":"8%"},{"v":14872,"d":"14,872.00"},{"v":0.08,"d":"8%"},{"v":14872,"d":"14,872.00"},{"v":0.08,"d":"8%"},{"v":14872,"d":"14,872.00"},{"v":0.08,"d":"8%"},{"v":14872,"d":"14,872.00"},{"v":0.08,"d":"8%"},{"v":1189.76,"d":"1,189.76"}]
["1976-12-01",{"v":14872,"d":"14,872.00"},{"v":0.08,"d":"8%"},{"v":14872,"d":"14,872.00"},{"v":0.08,"d":"8%"},{"v":14872,"d":"14,872.00"},{"v":0.08,"d":"8%"},{"v":14872,"d":"14,872.00"},{"v":0.08,"d":"8%"},{"v":14872,"d":"14,872.00"},{"v":0.08,"d":"8%"},{"v":1189.76,"d":"1,189.76"}]
["1977-01-01",{"v":14872,"d":"14,872.00"},{"v":0.08,"d":"8%"},{"v":14872,"d":"14,872.00"},{"v":0.08,"d":"8%"},{"v":14872,"d":"14,872.00"},{"v":0.08,"d":"8%"},{"v":14872,"d":"14,872.00"},{"v":0.08,"d":"8%"},{"v":14872,"d":"14,872.00"},{"v":0.08,"d":"8%"},{"v":1189.76,"d":"1,189.76"}]
["1977-02-01",{"v":14872,"d":"14,872.00"},{"v":0.08,"d":"8%"},{"v":14872,"d":"14,872.00"},{"v":0.08,"d":"8%"},{"v":14872,"d":"14,872.00"},{"v":0.08,"d":"8%"},{"v":14872,"d":"14,872.00"},{"v":0.08,"d":"8%"},{"v":14872,"d":"14,872.00"},{"v":0.08,"d":"8%"},{"v":1189.76,"d":"1,189.76"}]
["1977-03-01",{"v":14872,"d":"14,872.00"},{"v":0.08,"d":"8%"},{"v":14872,"d":"14,872.00"},{"v":0.08,"d":"8%"},{"v":14872,"d":"14,872.00"},{"v":0.08,"d":"8%"},{"v":14872,"d":"14,872.00"},{"v":0.08,"d":"8%"},{"v":14872,"d":"14,872.00"},{"v":0.08,"d":"8%"},{"v":1189.76,"d":"1,189.76"}]
["1977-04-01",{"v":14872,"d":"14,872.00"},{"v":0.08,"d":"8%"},{"v":14872,"d":"14,872.00"},{"v":0.08,"d":"8%"},{"v":14872,"d":"14,872.00"},{"v":0.08,"d":"8%"},{"v":14872,"d":"14,872.00"},{"v":0.08,"d":"8%"},{"v":14872,"d":"14,872.00"},{"v":0.08,"d":"8%"},{"v":1189.76,"d":"1,189.76"}]
["1977-05-01",{"v":20820,"d":"20,820.00"},{"v":0.08,"d":"8%"},{"v":20820,"d":"20,820.00"},{"v":0.08,"d":"8%"},{"v":20820,"d":"20,820.00"},{"v":0.08,"d":"8%"},{"v":20820,"d":"20,820.00"},{"v":0.08,"d":"8%"},{"v":20820,"d":"20,820.00"},{"v":0.08,"d":"8%"},{"v":1665.6,"d":"1,665.60"}]
["1977-06-01",{"v":20820,"d":"20,820.00"},{"v":0.08,"d":"8%"},{"v":20820,"d":"20,820.00"},{"v":0.08,"d":"8%"},{"v":20820,"d":"20,820.00"},{"v":0.08,"d":"8%"},{"v":20820,"d":"20,820.00"},{"v":0.08,"d":"8%"},{"v":20820,"d":"20,820.00"},{"v":0.08,"d":"8%"},{"v":1665.6,"d":"1,665.60"}]
["1977-07-01",{"v":20820,"d":"20,820.00"},{"v":0.08,"d":"8%"},{"v":20820,"d":"20,820.00"},{"v":0.08,"d":"8%"},{"v":20820,"d":"20,820.00"},{"v":0.08,"d":"8%"},{"v":20820,"d":"20,820.00"},{"v":0.08,"d":"8%"},{"v":20820,"d":"20,820.00"},{"v":0.08,"d":"8%"},{"v":1665.6,"d":"1,665.60"}]
["1977-08-01",{"v":20820,"d":"20,820.00"},{"v":0.08,"d":"8%"},{"v":20820,"d":"20,820.00"},{"v":0.08,"d":"8%"},{"v":20820,"d":"20,820.00"},{"v":0.08,"d":"8%"},{"v":20820,"d":"20,820.00"},{"v":0.08,"d":"8%"},{"v":20820,"d":"20,820.00"},{"v":0.08,"d":"8%"},{"v":1665.6,"d":"1,665.60"}]
["1977-09-01",{"v":20820,"d":"20,820.00"},{"v":0.08,"d":"8%"},{"v":20820,"d":"20,820.00"},{"v":0.08,"d":"8%"},{"v":20820,"d":"20,820.00"},{"v":0.08,"d":"8%"},{"v":20820,"d":"20,820.00"},{"v":0.08,"d":"8%"},{"v":20820,"d":"20,820.00"},{"v":0.08,"d":"8%"},{"v":1665.6,"d":"1,665.60"}]
["1977-10-01",{"v":20820,"d":"20,820.00"},{"v":0.08,"d":"8%"},{"v":20820,"d":"20,820.00"},{"v":0.08,"d":"8%"},{"v":20820,"d":"20,820.00"},{"v":0.08,"d":"8%"},{"v":20820,"d":"20,820.00"},{"v":0.08,"d":"8%"},{"v":20820,"d":"20,820.00"},{"v":0.08,"d":"8%"},{"v":1665.6,"d":"1,665.60"}]
["1977-11-01",{"v":20820,"d":"20,820.00"},{"v":0.08,"d":"8%"},{"v":20820,"d":"20,820.00"},{"v":0.08,"d":"8%"},{"v":20820,"d":"20,820.00"},{"v":0.08,"d":"8%"},{"v":20820,"d":"20,820.00"},{"v":0.08,"d":"8%"},{"v":20820,"d":"20,820.00"},{"v":0.08,"d":"8%"},{"v":1665.6,"d":"1,665.60"}]
["1977-12-01",{"v":20820,"d":"20,820.00"},{"v":0.08,"d":"8%"},{"v":20820,"d":"20,820.00"},{"v":0.08,"d":"8%"},{"v":20820,"d":"20,820.00"},{"v":0.08,"d":"8%"},{"v":20820,"d":"20,820.00"},{"v":0.08,"d":"8%"},{"v":20820,"d":"20,820.00"},{"v":0.08,"d":"8%"},{"v":1665.6,"d":"1,665.60"}]
["1978-01-01",{"v":20820,"d":"20,820.00"},{"v":0.08,"d":"8%"},{"v":20820,"d":"20,820.00"},{"v":0.08,"d":"8%"},{"v":20820,"d":"20,820.00"},{"v":0.08,"d":"8%"},{"v":20820,"d":"20,820.00"},{"v":0.08,"d":"8%"},{"v":20820,"d":"20,820.00"},{"v":0.08,"d":"8%"},{"v":1665.6,"d":"1,665.60"}]
["1978-02-01",{"v":20820,"d":"20,820.00"},{"v":0.08,"d":"8%"},{"v":20820,"d":"20,820.00"},{"v":0.08,"d":"8%"},{"v":20820,"d":"20,820.00"},{"v":0.08,"d":"8%"},{"v":20820,"d":"20,820.00"},{"v":0.08,"d":"8%"},{"v":20820,"d":"20,820.00"},{"v":0.08,"d":"8%"},{"v":1665.6,"d":"1,665.60"}]
["1978-03-01",{"v":20820,"d":"20,820.00"},{"v":0.08,"d":"8%"},{"v":20820,"d":"20,820.00"},{"v":0.08,"d":"8%"},{"v":20820,"d":"20,820.00"},{"v":0.08,"d":"8%"},{"v":20820,"d":"20,820.00"},{"v":0.08,"d":"8%"},{"v":20820,"d":"20,820.00"},{"v":0.08,"d":"8%"},{"v":1665.6,"d":"1,665.60"}]
["1978-04-01",{"v":20820,"d":"20,820.00"},{"v":0.08,"d":"8%"},{"v":20820,"d":"20,820.00"},{"v":0.08,"d":"8%"},{"v":20820,"d":"20,820.00"},{"v":0.08,"d":"8%"},{"v":20820,"d":"20,820.00"},{"v":0.08,"d":"8%"},{"v":20820,"d":"20,820.00"},{"v":0.08,"d":"8%"},{"v":1665.6,"d":"1,665.60"}]
["1978-05-01",{"v":28940,"d":"28,940.00"},{"v":0.08,"d":"8%"},{"v":28940,"d":"28,940.00"},{"v":0.08,"d":"8%"},{"v":28940,"d":"28,940.00"},{"v":0.08,"d":"8%"},{"v":28940,"d":"28,940.00"},{"v":0.08,"d":"8%"},{"v":28940,"d":"28,940.00"},{"v":0.08,"d":"8%"},{"v":2315.2,"d":"2,315.20"}]
["1978-06-01",{"v":28940,"d":"28,940.00"},{"v":0.08,"d":"8%"},{"v":28940,"d":"28,940.00"},{"v":0.08,"d":"8%"},{"v":28940,"d":"28,940.00"},{"v":0.08,"d":"8%"},{"v":28940,"d":"28,940.00"},{"v":0.08,"d":"8%"},{"v":28940,"d":"28,940.00"},{"v":0.08,"d":"8%"},{"v":2315.2,"d":"2,315.20"}]
["1978-07-01",{"v":28940,"d":"28,940.00"},{"v":0.08,"d":"8%"},{"v":28940,"d":"28,940.00"},{"v":0.08,"d":"8%"},{"v":28940,"d":"28,940.00"},{"v":0.08,"d":"8%"},{"v":28940,"d":"28,940.00"},{"v":0.08,"d":"8%"},{"v":28940,"d":"28,940.00"},{"v":0.08,"d":"8%"},{"v":2315.2,"d":"2,315.20"}]
["1978-08-01",{"v":28940,"d":"28,940.00"},{"v":0.08,"d":"8%"},{"v":28940,"d":"28,940.00"},{"v":0.08,"d":"8%"},{"v":28940,"d":"28,940.00"},{"v":0.08,"d":"8%"},{"v":28940,"d":"28,940.00"},{"v":0.08,"d":"8%"},{"v":28940,"d":"28,940.00"},{"v":0.08,"d":"8%"},{"v":2315.2,"d":"2,315.20"}]
["1978-09-01",{"v":28940,"d":"28,940.00"},{"v":0.08,"d":"8%"},{"v":28940,"d":"28,940.00"},{"v":0.08,"d":"8%"},{"v":28940,"d":"28,940.00"},{"v":0.08,"d":"8%"},{"v":28940,"d":"28,940.00"},{"v":0.08,"d":"8%"},{"v":28940,"d":"28,940.00"},{"v":0.08,"d":"8%"},{"v":2315.2,"d":"2,315.20"}]
["1978-10-01",{"v":28940,"d":"28,940.00"},{"v":0.08,"d":"8%"},{"v":28940,"d":"28,940.00"},{"v":0.08,"d":"8%"},{"v":28940,"d":"28,940.00"},{"v":0.08,"d":"8%"},{"v":28940,"d":"28,940.00"},{"v":0.08,"d":"8%"},{"v":28940,"d":"28,940.00"},{"v":0.08,"d":"8%"},{"v":2315.2,"d":"2,315.20"}]
["1978-11-01",{"v":28940,"d":"28,940.00"},{"v":0.08,"d":"8%"},{"v":28940,"d":"28,940.00"},{"v":0.08,"d":"8%"},{"v":28940,"d":"28,940.00"},{"v":0.08,"d":"8%"},{"v":28940,"d":"28,940.00"},{"v":0.08,"d":"8%"},{"v":28940,"d":"28,940.00"},{"v":0.08,"d":"8%"},{"v":2315.2,"d":"2,315.20"}]
["1978-12-01",{"v":28940,"d":"28,940.00"},{"v":0.08,"d":"8%"},{"v":28940,"d":"28,940.00"},{"v":0.08,"d":"8%"},{"v":28940,"d":"28,940.00"},{"v":0.08,"d":"8%"},{"v":28940,"d":"28,940.00"},{"v":0.08,"d":"8%"},{"v":28940,"d":"28,940.00"},{"v":0.08,"d":"8%"},{"v":2315.2,"d":"2,315.20"}]
["1979-01-01",{"v":28940,"d":"28,940.00"},{"v":0.08,"d":"8%"},{"v":28940,"d":"28,940.00"},{"v":0.08,"d":"8%"},{"v":28940,"d":"28,940.00"},{"v":0.08,"d":"8%"},{"v":28940,"d":"28,940.00"},{"v":0.08,"d":"8%"},{"v":28940,"d":"28,940.00"},{"v":0.08,"d":"8%"},{"v":2315.2,"d":"2,315.20"}]
["1979-02-01",{"v":28940,"d":"28,940.00"},{"v":0.08,"d":"8%"},{"v":28940,"d":"28,940.00"},{"v":0.08,"d":"8%"},{"v":28940,"d":"28,940.00"},{"v":0.08,"d":"8%"},{"v":28940,"d":"28,940.00"},{"v":0.08,"d":"8%"},{"v":28940,"d":"28,940.00"},{"v":0.08,"d":"8%"},{"v":2315.2,"d":"2,315.20"}]
["1979-03-01",{"v":28940,"d":"28,940.00"},{"v":0.08,"d":"8%"},{"v":28940,"d":"28,940.00"},{"v":0.08,"d":"8%"},{"v":28940,"d":"28,940.00"},{"v":0.08,"d":"8%"},{"v":28940,"d":"28,940.00"},{"v":0.08,"d":"8%"},{"v":28940,"d":"28,940.00"},{"v":0.08,"d":"8%"},{"v":2315.2,"d":"2,315.20"}]
["1979-04-01",{"v":28940,"d":"28,940.00"},{"v":0.08,"d":"8%"},{"v":28940,"d":"28,940.00"},{"v":0.08,"d":"8%"},{"v":28940,"d":"28,940.00"},{"v":0.08,"d":"8%"},{"v":28940,"d":"28,940.00"},{"v":0.08,"d":"8%"},{"v":28940,"d":"28,940.00"},{"v":0.08,"d":"8%"},{"v":2315.2,"d":"2,315.20"}]
["1979-05-01",{"v":41674,"d":"41,674.00"},{"v":0.08,"d":"8%"},{"v":41674,"d":"41,674.00"},{"v":0.08,"d":"8%"},{"v":41674,"d":"41,674.00"},{"v":0.08,"d":"8%"},{"v":41674,"d":"41,674.00"},{"v":0.08,"d":"8%"},{"v":41674,"d":"41,674.00"},{"v":0.08,"d":"8%"},{"v":3333.92,"d":"3,333.92"}]
["1979-06-01",{"v":41674,"d":"41,674.00"},{"v":0.08,"d":"8%"},{"v":41674,"d":"41,674.00"},{"v":0.08,"d":"8%"},{"v":41674,"d":"41,674.00"},{"v":0.08,"d":"8%"},{"v":41674,"d":"41,674.00"},{"v":0.08,"d":"8%"},{"v":41674,"d":"41,674.00"},{"v":0.08,"d":"8%"},{"v":3333.92,"d":"3,333.92"}]
["1979-07-01",{"v":41674,"d":"41,674.00"},{"v":0.08,"d":"8%"},{"v":41674,"d":"41,674.00"},{"v":0.08,"d":"8%"},{"v":41674,"d":"41,674.00"},{"v":0.08,"d":"8%"},{"v":41674,"d":"41,674.00"},{"v":0.08,"d":"8%"},{"v":41674,"d":"41,674.00"},{"v":0.08,"d":"8%"},{"v":3333.92,"d":"3,333.92"}]
["1979-08-01",{"v":41674,"d":"41,674.00"},{"v":0.08,"d":"8%"},{"v":41674,"d":"41,674.00"},{"v":0.08,"d":"8%"},{"v":41674,"d":"41,674.00"},{"v":0.08,"d":"8%"},{"v":41674,"d":"41,674.00"},{"v":0.08,"d":"8%"},{"v":41674,"d":"41,674.00"},{"v":0.08,"d":"8%"},{"v":3333.92,"d":"3,333.92"}]
["1979-09-01",{"v":41674,"d":"41,674.00"},{"v":0.08,"d":"8%"},{"v":41674,"d":"41,674.00"},{"v":0.08,"d":"8%"},{"v":41674,"d":"41,674.00"},{"v":0.08,"d":"8%"},{"v":41674,"d":"41,674.00"},{"v":0.08,"d":"8%"},{"v":41674,"d":"41,674.00"},{"v":0.08,"d":"8%"},{"v":3333.92,"d":"3,333.92"}]
["1979-10-01",{"v":41674,"d":"41,674.00"},{"v":0.08,"d":"8%"},{"v":41674,"d":"41,674.00"},{"v":0.08,"d":"8%"},{"v":41674,"d":"41,674.00"},{"v":0.08,"d":"8%"},{"v":41674,"d":"41,674.00"},{"v":0.08,"d":"8%"},{"v":41674,"d":"41,674.00"},{"v":0.08,"d":"8%"},{"v":3333.92,"d":"3,333.92"}]
["1979-11-01",{"v":51929,"d":"51,929.00"},{"v":0.08,"d":"8%"},{"v":51929,"d":"51,929.00"},{"v":0.08,"d":"8%"},{"v":51929,"d":"51,929.00"},{"v":0.08,"d":"8%"},{"v":51929,"d":"51,929.00"},{"v":0.08,"d":"8%"},{"v":51929,"d":"51,929.00"},{"v":0.08,"d":"8%"},{"v":4154.32,"d":"4,154.32"}]
["1979-12-01",{"v":51929,"d":"51,929.00"},{"v":0.08,"d":"8%"},{"v":51929,"d":"51,929.00"},{"v":0.08,"d":"8%"},{"v":51929,"d":"51,929.00"},{"v":0.08,"d":"8%"},{"v":51929,"d":"51,929.00"},{"v":0.08,"d":"8%"},{"v":51929,"d":"51,929.00"},{"v":0.08,"d":"8%"},{"v":4154.32,"d":"4,154.32"}]
["1980-01-01",{"v":51930,"d":"51,930.00"},{"v":0.08,"d":"8%"},{"v":51930,"d":"51,930.00"},{"v":0.08,"d":"8%"},{"v":51930,"d":"51,930.00"},{"v":0.08,"d":"8%"},{"v":51930,"d":"51,930.00"},{"v":0.08,"d":"8%"},{"v":51930,"d":"51,930.00"},{"v":0.08,"d":"8%"},{"v":4154.4,"d":"4,154.40"}]
["1980-02-01",{"v":51930,"d":"51,930.00"},{"v":0.08,"d":"8%"},{"v":51930,"d":"51,930.00"},{"v":0.08,"d":"8%"},{"v":51930,"d":"51,930.00"},{"v":0.08,"d":"8%"},{"v":51930,"d":"51,930.00"},{"v":0.08,"d":"8%"},{"v":51930,"d":"51,930.00"},{"v":0.08,"d":"8%"},{"v":4154.4,"d":"4,154.40"}]
["1980-03-01",{"v":51930,"d":"51,930.00"},{"v":0.08,"d":"8%"},{"v":51930,"d":"51,930.00"},{"v":0.08,"d":"8%"},{"v":51930,"d":"51,930.00"},{"v":0.08,"d":"8%"},{"v":51930,"d":"51,930.00"},{"v":0.08,"d":"8%"},{"v":51930,"d":"51,930.00"},{"v":0.08,"d":"8%"},{"v":4154.4,"d":"4,154.40"}]
["1980-04-01",{"v":51930,"d":"51,930.00"},{"v":0.08,"d":"8%"},{"v":51930,"d":"51,930.00"},{"v":0.08,"d":"8%"},{"v":51930,"d":"51,930.00"},{"v":0.08,"d":"8%"},{"v":51930,"d":"51,930.00"},{"v":0.08,"d":"8%"},{"v":51930,"d":"51,930.00"},{"v":0.08,"d":"8%"},{"v":4154.4,"d":"4,154.40"}]
["1980-05-01",{"v":70136,"d":"70,136.00"},{"v":0.08,"d":"8%"},{"v":70136,"d":"70,136.00"},{"v":0.08,"d":"8%"},{"v":70136,"d":"70,136.00"},{"v":0.08,"d":"8%"},{"v":70136,"d":"70,136.00"},{"v":0.08,"d":"8%"},{"v":70136,"d":"70,136.00"},{"v":0.08,"d":"8%"},{"v":5610.88,"d":"5,610.88"}]
["1980-06-01",{"v":70136,"d":"70,136.00"},{"v":0.08,"d":"8%"},{"v":70136,"d":"70,136.00"},{"v":0.08,"d":"8%"},{"v":70136,"d":"70,136.00"},{"v":0.08,"d":"8%"},{"v":70136,"d":"70,136.00"},{"v":0.08,"d":"8%"},{"v":70136,"d":"70,136.00"},{"v":0.08,"d":"8%"},{"v":5610.88,"d":"5,610.88"}]
["1980-07-01",{"v":70136,"d":"70,136.00"},{"v":0.08,"d":"8%"},{"v":70136,"d":"70,136.00"},{"v":0.08,"d":"8%"},{"v":70136,"d":"70,136.00"},{"v":0.08,"d":"8%"},{"v":70136,"d":"70,136.00"},{"v":0.08,"d":"8%"},{"v":70136,"d":"70,136.00"},{"v":0.08,"d":"8%"},{"v":5610.88,"d":"5,610.88"}]
["1980-08-01",{"v":70136,"d":"70,136.00"},{"v":0.08,"d":"8%"},{"v":70136,"d":"70,136.00"},{"v":0.08,"d":"8%"},{"v":70136,"d":"70,136.00"},{"v":0.08,"d":"8%"},{"v":70136,"d":"70,136.00"},{"v":0.08,"d":"8%"},{"v":70136,"d":"70,136.00"},{"v":0.08,"d":"8%"},{"v":5610.88,"d":"5,610.88"}]
["1980-09-01",{"v":70136,"d":"70,136.00"},{"v":0.08,"d":"8%"},{"v":70136,"d":"70,136.00"},{"v":0.08,"d":"8%"},{"v":70136,"d":"70,136.00"},{"v":0.08,"d":"8%"},{"v":70136,"d":"70,136.00"},{"v":0.08,"d":"8%"},{"v":70136,"d":"70,136.00"},{"v":0.08,"d":"8%"},{"v":5610.88,"d":"5,610.88"}]
["1980-10-01",{"v":70136,"d":"70,136.00"},{"v":0.08,"d":"8%"},{"v":70136,"d":"70,136.00"},{"v":0.08,"d":"8%"},{"v":70136,"d":"70,136.00"},{"v":0.08,"d":"8%"},{"v":70136,"d":"70,136.00"},{"v":0.08,"d":"8%"},{"v":70136,"d":"70,136.00"},{"v":0.08,"d":"8%"},{"v":5610.88,"d":"5,610.88"}]
["1980-11-01",{"v":93706,"d":"93,706.00"},{"v":0.08,"d":"8%"},{"v":93706,"d":"93,706.00"},{"v":0.08,"d":"8%"},{"v":93706,"d":"93,706.00"},{"v":0.08,"d":"8%"},{"v":93706,"d":"93,706.00"},{"v":0.08,"d":"8%"},{"v":93706,"d":"93,706.00"},{"v":0.08,"d":"8%"},{"v":7496.48,"d":"7,496.48"}]
["1980-12-01",{"v":93706,"d":"93,706.00"},{"v":0.08,"d":"8%"},{"v":93706,"d":"93,706.00"},{"v":0.08,"d":"8%"},{"v":93706,"d":"93,706.00"},{"v":0.08,"d":"8%"},{"v":93706,"d":"93,706.00"},{"v":0.08,"d":"8%"},{"v":93706,"d":"93,706.00"},{"v":0.08,"d":"8%"},{"v":7496.48,"d":"7,496.48"}]
["1981-01-01",{"v":93706,"d":"93,706.00"},{"v":0.08,"d":"8%"},{"v":93706,"d":"93,706.00"},{"v":0.08,"d":"8%"},{"v":93706,"d":"93,706.00"},{"v":0.08,"d":"8%"},{"v":93706,"d":"93,706.00"},{"v":0.08,"d":"8%"},{"v":93706,"d":"93,706.00"},{"v":0.08,"d":"8%"},{"v":7496.48,"d":"7,496.48"}]
["1981-02-01",{"v":93706,"d":"93,706.00"},{"v":0.08,"d":"8%"},{"v":93706,"d":"93,706.00"},{"v":0.08,"d":"8%"},{"v":93706,"d":"93,706.00"},{"v":0.08,"d":"8%"},{"v":93706,"d":"93,706.00"},{"v":0.08,"d":"8%"},{"v":93706,"d":"93,706.00"},{"v":0.08,"d":"8%"},{"v":7496.48,"d":"7,496.48"}]
["1981-03-01",{"v":93706,"d":"93,706.00"},{"v":0.08,"d":"8%"},{"v":93706,"d":"93,706.00"},{"v":0.08,"d":"8%"},{"v":93706,"d":"93,706.00"},{"v":0.08,"d":"8%"},{"v":93706,"d":"93,706.00"},{"v":0.08,"d":"8%"},{"v":93706,"d":"93,706.00"},{"v":0.08,"d":"8%"},{"v":7496.48,"d":"7,496.48"}]
["1981-04-01",{"v":93706,"d":"93,706.00"},{"v":0.08,"d":"8%"},{"v":93706,"d":"93,706.00"},{"v":0.08,"d":"8%"},{"v":93706,"d":"93,706.00"},{"v":0.08,"d":"8%"},{"v":93706,"d":"93,706.00"},{"v":0.08,"d":"8%"},{"v":93706,"d":"93,706.00"},{"v":0.08,"d":"8%"},{"v":7496.48,"d":"7,496.48"}]
["1981-05-01",{"v":133540,"d":"133,540.00"},{"v":0.08,"d":"8%"},{"v":133540,"d":"133,540.00"},{"v":0.08,"d":"8%"},{"v":133540,"d":"133,540.00"},{"v":0.08,"d":"8%"},{"v":133540,"d":"133,540.00"},{"v":0.08,"d":"8%"},{"v":133540,"d":"133,540.00"},{"v":0.08,"d":"8%"},{"v":10683.2,"d":"10,683.20"}]
["1981-06-01",{"v":133540,"d":"133,540.00"},{"v":0.08,"d":"8%"},{"v":133540,"d":"133,540.00"},{"v":0.08,"d":"8%"},{"v":133540,"d":"133,540.00"},{"v":0.08,"d":"8%"},{"v":133540,"d":"133,540.00"},{"v":0.08,"d":"8%"},{"v":133540,"d":"133,540.00"},{"v":0.08,"d":"8%"},{"v":10683.2,"d":"10,683.20"}]
["1981-07-01",{"v":133540,"d":"133,540.00"},{"v":0.08,"d":"8%"},{"v":133540,"d":"133,540.00"},{"v":0.08,"d":"8%"},{"v":133540,"d":"133,540.00"},{"v":0.08,"d":"8%"},{"v":133540,"d":"133,540.00"},{"v":0.08,"d":"8%"},{"v":133540,"d":"133,540.00"},{"v":0.08,"d":"8%"},{"v":10683.2,"d":"10,683.20"}]
["1981-08-01",{"v":133540,"d":"133,540.00"},{"v":0.08,"d":"8%"},{"v":133540,"d":"133,540.00"},{"v":0.08,"d":"8%"},{"v":133540,"d":"133,540.00"},{"v":0.08,"d":"8%"},{"v":133540,"d":"133,540.00"},{"v":0.08,"d":"8%"},{"v":133540,"d":"133,540.00"},{"v":0.08,"d":"8%"},{"v":10683.2,"d":"10,683.20"}]
["1981-09-01",{"v":133540,"d":"133,540.00"},{"v":0.08,"d":"8%"},{"v":133540,"d":"133,540.00"},{"v":0.08,"d":"8%"},{"v":133540,"d":"133,540.00"},{"v":0.08,"d":"8%"},{"v":133540,"d":"133,540.00"},{"v":0.08,"d":"8%"},{"v":133540,"d":"133,540.00"},{"v":0.08,"d":"8%"},{"v":10683.2,"d":"10,683.20"}]
["1981-10-01",{"v":133540,"d":"133,540.00"},{"v":0.08,"d":"8%"},{"v":133540,"d":"133,540.00"},{"v":0.08,"d":"8%"},{"v":133540,"d":"133,540.00"},{"v":0.08,"d":"8%"},{"v":133540,"d":"133,540.00"},{"v":0.08,"d":"8%"},{"v":133540,"d":"133,540.00"},{"v":0.08,"d":"8%"},{"v":10683.2,"d":"10,683.20"}]
["1981-11-01",{"v":184390,"d":"184,390.00"},{"v":0.08,"d":"8%"},{"v":184390,"d":"184,390.00"},{"v":0.08,"d":"8%"},{"v":184390,"d":"184,390.00"},{"v":0.08,"d":"8%"},{"v":184390,"d":"184,390.00"},{"v":0.08,"d":"8%"},{"v":184390,"d":"184,390.00"},{"v":0.08,"d":"8%"},{"v":14751.2,"d":"14,751.20"}]
["1981-12-01",{"v":238560,"d":"238,560.00"},{"v":0.08,"d":"8%"},{"v":238560,"d":"238,560.00"},{"v":0.08,"d":"8%"},{"v":238560,"d":"238,560.00"},{"v":0.08,"d":"8%"},{"v":238560,"d":"238,560.00"},{"v":0.08,"d":"8%"},{"v":238560,"d":"238,560.00"},{"v":0.08,"d":"8%"},{"v":19084.8,"d":"19,084.80"}]
["1982-01-01",{"v":35784,"d":"35,784.00"},{"v":0.085,"d":"8.50%"},{"v":59640,"d":"59,640.00"},{"v":0.0875,"d":"8.75%"},{"v":119280,"d":"119,280.00"},{"v":0.09,"d":"9.00%"},{"v":178920,"d":"178,920.00"},{"v":0.095,"d":"9.50%"},{"v":238560,"d":"238,560.00"},{"v":0.1,"d":"10.00%"},{"v":23856,"d":"23,856.00"}]
["1982-02-01",{"v":35784,"d":"35,784.00"},{"v":0.085,"d":"8.50%"},{"v":59640,"d":"59,640.00"},{"v":0.0875,"d":"8.75%"},{"v":119280,"d":"119,280.00"},{"v":0.09,"d":"9.00%"},{"v":178920,"d":"178,920.00"},{"v":0.095,"d":"9.50%"},{"v":238560,"d":"238,560.00"},{"v":0.1,"d":"10.00%"},{"v":23856,"d":"23,856.00"}]
["1982-03-01",{"v":35784,"d":"35,784.00"},{"v":0.085,"d":"8.50%"},{"v":59640,"d":"59,640.00"},{"v":0.0875,"d":"8.75%"},{"v":119280,"d":"119,280.00"},{"v":0.09,"d":"9.00%"},{"v":178920,"d":"178,920.00"},{"v":0.095,"d":"9.50%"},{"v":238560,"d":"238,560.00"},{"v":0.1,"d":"10.00%"},{"v":23856,"d":"23,856.00"}]
["1982-04-01",{"v":35784,"d":"35,784.00"},{"v":0.085,"d":"8.50%"},{"v":59640,"d":"59,640.00"},{"v":0.0875,"d":"8.75%"},{"v":119280,"d":"119,280.00"},{"v":0.09,"d":"9.00%"},{"v":178920,"d":"178,920.00"},{"v":0.095,"d":"9.50%"},{"v":238560,"d":"238,560.00"},{"v":0.1,"d":"10.00%"},{"v":23856,"d":"23,856.00"}]
["1982-05-01",{"v":49824,"d":"49,824.00"},{"v":0.085,"d":"8.50%"},{"v":83040,"d":"83,040.00"},{"v":0.0875,"d":"8.75%"},{"v":166080,"d":"166,080.00"},{"v":0.09,"d":"9.00%"},{"v":249120,"d":"249,120.00"},{"v":0.095,"d":"9.50%"},{"v":322160,"d":"322,160.00"},{"v":0.1,"d":"10.00%"},{"v":32216,"d":"32,216.00"}]
["1982-06-01",{"v":49824,"d":"49,824.00"},{"v":0.085,"d":"8.50%"},{"v":83040,"d":"83,040.00"},{"v":0.0875,"d":"8.75%"},{"v":166080,"d":"166,080.00"},{"v":0.09,"d":"9.00%"},{"v":249120,"d":"249,120.00"},{"v":0.095,"d":"9.50%"},{"v":322160,"d":"322,160.00"},{"v":0.1,"d":"10.00%"},{"v":32216,"d":"32,216.00"}]
["1982-07-01",{"v":49824,"d":"49,824.00"},{"v":0.085,"d":"8.50%"},{"v":83040,"d":"83,040.00"},{"v":0.0875,"d":"8.75%"},{"v":166080,"d":"166,080.00"},{"v":0.09,"d":"9.00%"},{"v":249120,"d":"249,120.00"},{"v":0.095,"d":"9.50%"},{"v":322160,"d":"322,160.00"},{"v":0.1,"d":"10.00%"},{"v":32216,"d":"32,216.00"}]
["1982-08-01",{"v":49824,"d":"49,824.00"},{"v":0.085,"d":"8.50%"},{"v":83040,"d":"83,040.00"},{"v":0.0875,"d":"8.75%"},{"v":166080,"d":"166,080.00"},{"v":0.09,"d":"9.00%"},{"v":249120,"d":"249,120.00"},{"v":0.095,"d":"9.50%"},{"v":322160,"d":"322,160.00"},{"v":0.1,"d":"10.00%"},{"v":32216,"d":"32,216.00"}]
["1982-09-01",{"v":49824,"d":"49,824.00"},{"v":0.085,"d":"8.50%"},{"v":83040,"d":"83,040.00"},{"v":0.0875,"d":"8.75%"},{"v":166080,"d":"166,080.00"},{"v":0.09,"d":"9.00%"},{"v":249120,"d":"249,120.00"},{"v":0.095,"d":"9.50%"},{"v":322160,"d":"322,160.00"},{"v":0.1,"d":"10.00%"},{"v":32216,"d":"32,216.00"}]
["1982-10-01",{"v":49824,"d":"49,824.00"},{"v":0.085,"d":"8.50%"},{"v":83040,"d":"83,040.00"},{"v":0.0875,"d":"8.75%"},{"v":166080,"d":"166,080.00"},{"v":0.09,"d":"9.00%"},{"v":249120,"d":"249,120.00"},{"v":0.095,"d":"9.50%"},{"v":322160,"d":"322,160.00"},{"v":0.1,"d":"10.00%"},{"v":32216,"d":"32,216.00"}]
["1982-11-01",{"v":70704,"d":"70,704.00"},{"v":0.085,"d":"8.50%"},{"v":117840,"d":"117,840.00"},{"v":0.0875,"d":"8.75%"},{"v":235680,"d":"235,680.00"},{"v":0.09,"d":"9.00%"},{"v":353520,"d":"353,520.00"},{"v":0.095,"d":"9.50%"},{"v":471360,"d":"471,360.00"},{"v":0.1,"d":"10.00%"},{"v":47136,"d":"47,136.00"}]
["1982-12-01",{"v":70704,"d":"70,704.00"},{"v":0.085,"d":"8.50%"},{"v":117840,"d":"117,840.00"},{"v":0.0875,"d":"8.75%"},{"v":235680,"d":"235,680.00"},{"v":0.09,"d":"9.00%"},{"v":353520,"d":"353,520.00"},{"v":0.095,"d":"9.50%"},{"v":471360,"d":"471,360.00"},{"v":0.1,"d":"10.00%"},{"v":47136,"d":"47,136.00"}]
["1983-01-01",{"v":70704,"d":"70,704.00"},{"v":0.085,"d":"8.50%"},{"v":117840,"d":"117,840.00"},{"v":0.0875,"d":"8.75%"},{"v":235680,"d":"235,680.00"},{"v":0.09,"d":"9.00%"},{"v":353520,"d":"353,520.00"},{"v":0.095,"d":"9.50%"},{"v":471360,"d":"471,360.00"},{"v":0.1,"d":"10.00%"},{"v":47136,"d":"47,136.00"}]
["1983-02-01",{"v":70704,"d":"70,704.00"},{"v":0.085,"d":"8.50%"},{"v":117840,"d":"117,840.00"},{"v":0.0875,"d":"8.75%"},{"v":235680,"d":"235,680.00"},{"v":0.09,"d":"9.00%"},{"v":353520,"d":"353,520.00"},{"v":0.095,"d":"9.50%"},{"v":471360,"d":"471,360.00"},{"v":0.1,"d":"10.00%"},{"v":47136,"d":"47,136.00"}]
["1983-03-01",{"v":70704,"d":"70,704.00"},{"v":0.085,"d":"8.50%"},{"v":117840,"d":"117,840.00"},{"v":0.0875,"d":"8.75%"},{"v":235680,"d":"235,680.00"},{"v":0.09,"d":"9.00%"},{"v":353520,"d":"353,520.00"},{"v":0.095,"d":"9.50%"},{"v":471360,"d":"471,360.00"},{"v":0.1,"d":"10.00%"},{"v":47136,"d":"47,136.00"}]
["1983-04-01",{"v":70704,"d":"70,704.00"},{"v":0.085,"d":"8.50%"},{"v":117840,"d":"117,840.00"},{"v":0.0875,"d":"8.75%"},{"v":235680,"d":"235,680.00"},{"v":0.09,"d":"9.00%"},{"v":353520,"d":"353,520.00"},{"v":0.095,"d":"9.50%"},{"v":471360,"d":"471,360.00"},{"v":0.1,"d":"10.00%"},{"v":47136,"d":"47,136.00"}]
["1983-05-01",{"v":104328,"d":"104,328.00"},{"v":0.085,"d":"8.50%"},{"v":173880,"d":"173,880.00"},{"v":0.0875,"d":"8.75%"},{"v":347760,"d":"347,760.00"},{"v":0.09,"d":"9.00%"},{"v":521640,"d":"521,640.00"},{"v":0.095,"d":"9.50%"},{"v":695520,"d":"695,520.00"},{"v":0.1,"d":"10.00%"},{"v":69552,"d":"69,552.00"}]
["1983-06-01",{"v":104328,"d":"104,328.00"},{"v":0.085,"d":"8.50%"},{"v":173880,"d":"173,880.00"},{"v":0.0875,"d":"8.75%"},{"v":347760,"d":"347,760.00"},{"v":0.09,"d":"9.00%"},{"v":521640,"d":"521,640.00"},{"v":0.095,"d":"9.50%"},{"v":695520,"d":"695,520.00"},{"v":0.1,"d":"10.00%"},{"v":69552,"d":"69,552.00"}]
["1983-07-01",{"v":104328,"d":"104,328.00"},{"v":0.085,"d":"8.50%"},{"v":173880,"d":"173,880.00"},{"v":0.0875,"d":"8.75%"},{"v":347760,"d":"347,760.00"},{"v":0.09,"d":"9.00%"},{"v":521640,"d":"521,640.00"},{"v":0.095,"d":"9.50%"},{"v":695520,"d":"695,520.00"},{"v":0.1,"d":"10.00%"},{"v":69552,"d":"69,552.00"}]
["1983-08-01",{"v":104328,"d":"104,328.00"},{"v":0.085,"d":"8.50%"},{"v":173880,"d":"173,880.00"},{"v":0.0875,"d":"8.75%"},{"v":347760,"d":"347,760.00"},{"v":0.09,"d":"9.00%"},{"v":521640,"d":"521,640.00"},{"v":0.095,"d":"9.50%"},{"v":695520,"d":"695,520.00"},{"v":0.1,"d":"10.00%"},{"v":69552,"d":"69,552.00"}]
["1983-09-01",{"v":104328,"d":"104,328.00"},{"v":0.085,"d":"8.50%"},{"v":173880,"d":"173,880.00"},{"v":0.0875,"d":"8.75%"},{"v":347760,"d":"347,760.00"},{"v":0.09,"d":"9.00%"},{"v":521640,"d":"521,640.00"},{"v":0.095,"d":"9.50%"},{"v":695520,"d":"695,520.00"},{"v":0.1,"d":"10.00%"},{"v":69552,"d":"69,552.00"}]
["1983-10-01",{"v":104328,"d":"104,328.00"},{"v":0.085,"d":"8.50%"},{"v":173880,"d":"173,880.00"},{"v":0.0875,"d":"8.75%"},{"v":347760,"d":"347,760.00"},{"v":0.09,"d":"9.00%"},{"v":521640,"d":"521,640.00"},{"v":0.095,"d":"9.50%"},{"v":695520,"d":"695,520.00"},{"v":0.1,"d":"10.00%"},{"v":69552,"d":"69,552.00"}]
["1983-11-01",{"v":171360,"d":"171,360.00"},{"v":0.085,"d":"8.50%"},{"v":285600,"d":"285,600.00"},{"v":0.0875,"d":"8.75%"},{"v":571200,"d":"571,200.00"},{"v":0.09,"d":"9.00%"},{"v":856800,"d":"856,800.00"},{"v":0.095,"d":"9.50%"},{"v":1142400,"d":"1,142,400.00"},{"v":0.1,"d":"10.00%"},{"v":114240,"d":"114,240.00"}]
["1983-12-01",{"v":171360,"d":"171,360.00"},{"v":0.085,"d":"8.50%"},{"v":285600,"d":"285,600.00"},{"v":0.0875,"d":"8.75%"},{"v":571200,"d":"571,200.00"},{"v":0.09,"d":"9.00%"},{"v":856800,"d":"856,800.00"},{"v":0.095,"d":"9.50%"},{"v":1142400,"d":"1,142,400.00"},{"v":0.1,"d":"10.00%"},{"v":114240,"d":"114,240.00"}]
["1984-01-01",{"v":171360,"d":"171,360.00"},{"v":0.085,"d":"8.50%"},{"v":285600,"d":"285,600.00"},{"v":0.0875,"d":"8.75%"},{"v":571200,"d":"571,200.00"},{"v":0.09,"d":"9.00%"},{"v":856800,"d":"856,800.00"},{"v":0.095,"d":"9.50%"},{"v":1142400,"d":"1,142,400.00"},{"v":0.1,"d":"10.00%"},{"v":114240,"d":"114,240.00"}]
["1984-02-01",{"v":171360,"d":"171,360.00"},{"v":0.085,"d":"8.50%"},{"v":285600,"d":"285,600.00"},{"v":0.0875,"d":"8.75%"},{"v":571200,"d":"571,200.00"},{"v":0.09,"d":"9.00%"},{"v":856800,"d":"856,800.00"},{"v":0.095,"d":"9.50%"},{"v":1142400,"d":"1,142,400.00"},{"v":0.1,"d":"10.00%"},{"v":114240,"d":"114,240.00"}]
["1984-03-01",{"v":171360,"d":"171,360.00"},{"v":0.085,"d":"8.50%"},{"v":285600,"d":"285,600.00"},{"v":0.0875,"d":"8.75%"},{"v":571200,"d":"571,200.00"},{"v":0.09,"d":"9.00%"},{"v":856800,"d":"856,800.00"},{"v":0.095,"d":"9.50%"},{"v":1142400,"d":"1,142,400.00"},{"v":0.1,"d":"10.00%"},{"v":114240,"d":"114,240.00"}]
["1984-04-01",{"v":171360,"d":"171,360.00"},{"v":0.085,"d":"8.50%"},{"v":285600,"d":"285,600.00"},{"v":0.0875,"d":"8.75%"},{"v":571200,"d":"571,200.00"},{"v":0.09,"d":"9.00%"},{"v":856800,"d":"856,800.00"},{"v":0.095,"d":"9.50%"},{"v":1142400,"d":"1,142,400.00"},{"v":0.1,"d":"10.00%"},{"v":114240,"d":"114,240.00"}]
["1984-05-01",{"v":291528,"d":"291,528.00"},{"v":0.085,"d":"8.50%"},{"v":485880,"d":"485,880.00"},{"v":0.0875,"d":"8.75%"},{"v":971760,"d":"971,760.00"},{"v":0.09,"d":"9.00%"},{"v":1457640,"d":"1,457,640.00"},{"v":0.095,"d":"9.50%"},{"v":1943520,"d":"1,943,520.00"},{"v":0.1,"d":"10.00%"},{"v":194352,"d":"194,352.00"}]
["1984-06-01",{"v":291528,"d":"291,528.00"},{"v":0.085,"d":"8.50%"},{"v":485880,"d":"485,880.00"},{"v":0.0875,"d":"8.75%"},{"v":971760,"d":"971,760.00"},{"v":0.09,"d":"9.00%"},{"v":1457640,"d":"1,457,640.00"},{"v":0.095,"d":"9.50%"},{"v":1943520,"d":"1,943,520.00"},{"v":0.1,"d":"10.00%"},{"v":194352,"d":"194,352.00"}]
["1984-07-01",{"v":291528,"d":"291,528.00"},{"v":0.085,"d":"8.50%"},{"v":485880,"d":"485,880.00"},{"v":0.0875,"d":"8.75%"},{"v":971760,"d":"971,760.00"},{"v":0.09,"d":"9.00%"},{"v":1457640,"d":"1,457,640.00"},{"v":0.095,"d":"9.50%"},{"v":1943520,"d":"1,943,520.00"},{"v":0.1,"d":"10.00%"},{"v":194352,"d":"194,352.00"}]
["1984-08-01",{"v":291528,"d":"291,528.00"},{"v":0.085,"d":"8.50%"},{"v":485880,"d":"485,880.00"},{"v":0.0875,"d":"8.75%"},{"v":971760,"d":"971,760.00"},{"v":0.09,"d":"9.00%"},{"v":1457640,"d":"1,457,640.00"},{"v":0.095,"d":"9.50%"},{"v":1943520,"d":"1,943,520.00"},{"v":0.1,"d":"10.00%"},{"v":194352,"d":"194,352.00"}]
["1984-09-01",{"v":291528,"d":"291,528.00"},{"v":0.085,"d":"8.50%"},{"v":485880,"d":"485,880.00"},{"v":0.0875,"d":"8.75%"},{"v":971760,"d":"971,760.00"},{"v":0.09,"d":"9.00%"},{"v":1457640,"d":"1,457,640.00"},{"v":0.095,"d":"9.50%"},{"v":1943520,"d":"1,943,520.00"},{"v":0.1,"d":"10.00%"},{"v":194352,"d":"194,352.00"}]
["1984-10-01",{"v":291528,"d":"291,528.00"},{"v":0.085,"d":"8.50%"},{"v":485880,"d":"485,880.00"},{"v":0.0875,"d":"8.75%"},{"v":971760,"d":"971,760.00"},{"v":0.09,"d":"9.00%"},{"v":1457640,"d":"1,457,640.00"},{"v":0.095,"d":"9.50%"},{"v":1943520,"d":"1,943,520.00"},{"v":0.1,"d":"10.00%"},{"v":194352,"d":"194,352.00"}]
["1984-11-01",{"v":499680,"d":"499,680.00"},{"v":0.085,"d":"8.50%"},{"v":832800,"d":"832,800.00"},{"v":0.0875,"d":"8.75%"},{"v":1665600,"d":"1,665,600.00"},{"v":0.09,"d":"9.00%"},{"v":2498400,"d":"2,498,400.00"},{"v":0.095,"d":"9.50%"},{"v":3331200,"d":"3,331,200.00"},{"v":0.1,"d":"10.00%"},{"v":333120,"d":"333,120.00"}]
["1984-12-01",{"v":499680,"d":"499,680.00"},{"v":0.085,"d":"8.50%"},{"v":832800,"d":"832,800.00"},{"v":0.0875,"d":"8.75%"},{"v":1665600,"d":"1,665,600.00"},{"v":0.09,"d":"9.00%"},{"v":2498400,"d":"2,498,400.00"},{"v":0.095,"d":"9.50%"},{"v":3331200,"d":"3,331,200.00"},{"v":0.1,"d":"10.00%"},{"v":333120,"d":"333,120.00"}]
["1985-01-01",{"v":499680,"d":"499,680.00"},{"v":0.085,"d":"8.50%"},{"v":832800,"d":"832,800.00"},{"v":0.0875,"d":"8.75%"},{"v":1665600,"d":"1,665,600.00"},{"v":0.09,"d":"9.00%"},{"v":2498400,"d":"2,498,400.00"},{"v":0.095,"d":"9.50%"},{"v":3331200,"d":"3,331,200.00"},{"v":0.1,"d":"10.00%"},{"v":333120,"d":"333,120.00"}]
["1985-02-01",{"v":499680,"d":"499,680.00"},{"v":0.085,"d":"8.50%"},{"v":832800,"d":"832,800.00"},{"v":0.0875,"d":"8.75%"},{"v":1665600,"d":"1,665,600.00"},{"v":0.09,"d":"9.00%"},{"v":2498400,"d":"2,498,400.00"},{"v":0.095,"d":"9.50%"},{"v":3331200,"d":"3,331,200.00"},{"v":0.1,"d":"10.00%"},{"v":333120,"d":"333,120.00"}]
["1985-03-01",{"v":499680,"d":"499,680.00"},{"v":0.085,"d":"8.50%"},{"v":832800,"d":"832,800.00"},{"v":0.0875,"d":"8.75%"},{"v":1665600,"d":"1,665,600.00"},{"v":0.09,"d":"9.00%"},{"v":2498400,"d":"2,498,400.00"},{"v":0.095,"d":"9.50%"},{"v":3331200,"d":"3,331,200.00"},{"v":0.1,"d":"10.00%"},{"v":333120,"d":"333,120.00"}]
["1985-04-01",{"v":499680,"d":"499,680.00"},{"v":0.085,"d":"8.50%"},{"v":832800,"d":"832,800.00"},{"v":0.0875,"d":"8.75%"},{"v":1665600,"d":"1,665,600.00"},{"v":0.09,"d":"9.00%"},{"v":2498400,"d":"2,498,400.00"},{"v":0.095,"d":"9.50%"},{"v":3331200,"d":"3,331,200.00"},{"v":0.1,"d":"10.00%"},{"v":333120,"d":"333,120.00"}]
["1985-05-01",{"v":999360,"d":"999,360.00"},{"v":0.085,"d":"8.50%"},{"v":1665600,"d":"1,665,600.00"},{"v":0.0875,"d":"8.75%"},{"v":3331200,"d":"3,331,200.00"},{"v":0.09,"d":"9.00%"},{"v":4996800,"d":"4,996,800.00"},{"v":0.095,"d":"9.50%"},{"v":6662400,"d":"6,662,400.00"},{"v":0.1,"d":"10.00%"},{"v":666240,"d":"666,240.00"}]
["1985-06-01",{"v":999360,"d":"999,360.00"},{"v":0.085,"d":"8.50%"},{"v":1665600,"d":"1,665,600.00"},{"v":0.0875,"d":"8.75%"},{"v":3331200,"d":"3,331,200.00"},{"v":0.09,"d":"9.00%"},{"v":4996800,"d":"4,996,800.00"},{"v":0.095,"d":"9.50%"},{"v":6662400,"d":"6,662,400.00"},{"v":0.1,"d":"10.00%"},{"v":666240,"d":"666,240.00"}]
["1985-07-01",{"v":999360,"d":"999,360.00"},{"v":0.085,"d":"8.50%"},{"v":1665600,"d":"1,665,600.00"},{"v":0.0875,"d":"8.75%"},{"v":3331200,"d":"3,331,200.00"},{"v":0.09,"d":"9.00%"},{"v":4996800,"d":"4,996,800.00"},{"v":0.095,"d":"9.50%"},{"v":6662400,"d":"6,662,400.00"},{"v":0.1,"d":"10.00%"},{"v":666240,"d":"666,240.00"}]
["1985-08-01",{"v":999360,"d":"999,360.00"},{"v":0.085,"d":"8.50%"},{"v":1665600,"d":"1,665,600.00"},{"v":0.0875,"d":"8.75%"},{"v":3331200,"d":"3,331,200.00"},{"v":0.09,"d":"9.00%"},{"v":4996800,"d":"4,996,800.00"},{"v":0.095,"d":"9.50%"},{"v":6662400,"d":"6,662,400.00"},{"v":0.1,"d":"10.00%"},{"v":666240,"d":"666,240.00"}]
["1985-09-01",{"v":999360,"d":"999,360.00"},{"v":0.085,"d":"8.50%"},{"v":1665600,"d":"1,665,600.00"},{"v":0.0875,"d":"8.75%"},{"v":3331200,"d":"3,331,200.00"},{"v":0.09,"d":"9.00%"},{"v":4996800,"d":"4,996,800.00"},{"v":0.095,"d":"9.50%"},{"v":6662400,"d":"6,662,400.00"},{"v":0.1,"d":"10.00%"},{"v":666240,"d":"666,240.00"}]
["1985-10-01",{"v":999360,"d":"999,360.00"},{"v":0.085,"d":"8.50%"},{"v":1665600,"d":"1,665,600.00"},{"v":0.0875,"d":"8.75%"},{"v":3331200,"d":"3,331,200.00"},{"v":0.09,"d":"9.00%"},{"v":4996800,"d":"4,996,800.00"},{"v":0.095,"d":"9.50%"},{"v":6662400,"d":"6,662,400.00"},{"v":0.1,"d":"10.00%"},{"v":666240,"d":"666,240.00"}]
["1985-11-01",{"v":1800000,"d":"1,800,000.00"},{"v":0.085,"d":"8.50%"},{"v":3000000,"d":"3,000,000.00"},{"v":0.0875,"d":"8.75%"},{"v":6000000,"d":"6,000,000.00"},{"v":0.09,"d":"9.00%"},{"v":9000000,"d":"9,000,000.00"},{"v":0.095,"d":"9.50%"},{"v":12000000,"d":"12,000,000.00"},{"v":0.1,"d":"10.00%"},{"v":1200000,"d":"1,200,000.00"}]
["1985-12-01",{"v":1800000,"d":"1,800,000.00"},{"v":0.085,"d":"8.50%"},{"v":3000000,"d":"3,000,000.00"},{"v":0.0875,"d":"8.75%"},{"v":6000000,"d":"6,000,000.00"},{"v":0.09,"d":"9.00%"},{"v":9000000,"d":"9,000,000.00"},{"v":0.095,"d":"9.50%"},{"v":12000000,"d":"12,000,000.00"},{"v":0.1,"d":"10.00%"},{"v":1200000,"d":"1,200,000.00"}]
["1986-01-01",{"v":1800000,"d":"1,800,000.00"},{"v":0.085,"d":"8.50%"},{"v":3000000,"d":"3,000,000.00"},{"v":0.0875,"d":"8.75%"},{"v":6000000,"d":"6,000,000.00"},{"v":0.09,"d":"9.00%"},{"v":9000000,"d":"9,000,000.00"},{"v":0.095,"d":"9.50%"},{"v":12000000,"d":"12,000,000.00"},{"v":0.1,"d":"10.00%"},{"v":1200000,"d":"1,200,000.00"}]
["1986-02-01",{"v":1800000,"d":"1,800,000.00"},{"v":0.085,"d":"8.50%"},{"v":3000000,"d":"3,000,000.00"},{"v":0.0875,"d":"8.75%"},{"v":6000000,"d":"6,000,000.00"},{"v":0.09,"d":"9.00%"},{"v":9000000,"d":"9,000,000.00"},{"v":0.095,"d":"9.50%"},{"v":12000000,"d":"12,000,000.00"},{"v":0.1,"d":"10.00%"},{"v":1200000,"d":"1,200,000.00"}]
["1986-03-01",{"v":2412,"d":"2,412.00"},{"v":0.085,"d":"8.50%"},{"v":4020,"d":"4,020.00"},{"v":0.0875,"d":"8.75%"},{"v":8040,"d":"8,040.00"},{"v":0.09,"d":"9.00%"},{"v":12060,"d":"12,060.00"},{"v":0.095,"d":"9.50%"},{"v":16080,"d":"16,080.00"},{"v":0.1,"d":"10.00%"},{"v":1608,"d":"1,608.00"}]
["1986-04-01",{"v":2412,"d":"2,412.00"},{"v":0.085,"d":"8.50%"},{"v":4020,"d":"4,020.00"},{"v":0.0875,"d":"8.75%"},{"v":8040,"d":"8,040.00"},{"v":0.09,"d":"9.00%"},{"v":12060,"d":"12,060.00"},{"v":0.095,"d":"9.50%"},{"v":16080,"d":"16,080.00"},{"v":0.1,"d":"10.00%"},{"v":1608,"d":"1,608.00"}]
["1986-05-01",{"v":2412,"d":"2,412.00"},{"v":0.085,"d":"8.50%"},{"v":4020,"d":"4,020.00"},{"v":0.0875,"d":"8.75%"},{"v":8040,"d":"8,040.00"},{"v":0.09,"d":"9.00%"},{"v":12060,"d":"12,060.00"},{"v":0.095,"d":"9.50%"},{"v":16080,"d":"16,080.00"},{"v":0.1,"d":"10.00%"},{"v":1608,"d":"1,608.00"}]
["1986-06-01",{"v":2412,"d":"2,412.00"},{"v":0.085,"d":"8.50%"},{"v":4020,"d":"4,020.00"},{"v":0.0875,"d":"8.75%"},{"v":8040,"d":"8,040.00"},{"v":0.09,"d":"9.00%"},{"v":12060,"d":"12,060.00"},{"v":0.095,"d":"9.50%"},{"v":16080,"d":"16,080.00"},{"v":0.1,"d":"10.00%"},{"v":1608,"d":"1,608.00"}]
["1986-07-01",{"v":2412,"d":"2,412.00"},{"v":0.085,"d":"8.50%"},{"v":4020,"d":"4,020.00"},{"v":0.0875,"d":"8.75%"},{"v":8040,"d":"8,040.00"},{"v":0.09,"d":"9.00%"},{"v":12060,"d":"12,060.00"},{"v":0.095,"d":"9.50%"},{"v":16080,"d":"16,080.00"},{"v":0.1,"d":"10.00%"},{"v":1608,"d":"1,608.00"}]
["1986-08-01",{"v":2412,"d":"2,412.00"},{"v":0.085,"d":"8.50%"},{"v":4020,"d":"4,020.00"},{"v":0.0875,"d":"8.75%"},{"v":8040,"d":"8,040.00"},{"v":0.09,"d":"9.00%"},{"v":12060,"d":"12,060.00"},{"v":0.095,"d":"9.50%"},{"v":16080,"d":"16,080.00"},{"v":0.1,"d":"10.00%"},{"v":1608,"d":"1,608.00"}]
["1986-09-01",{"v":2412,"d":"2,412.00"},{"v":0.085,"d":"8.50%"},{"v":4020,"d":"4,020.00"},{"v":0.0875,"d":"8.75%"},{"v":8040,"d":"8,040.00"},{"v":0.09,"d":"9.00%"},{"v":12060,"d":"12,060.00"},{"v":0.095,"d":"9.50%"},{"v":16080,"d":"16,080.00"},{"v":0.1,"d":"10.00%"},{"v":1608,"d":"1,608.00"}]
["1986-10-01",{"v":2412,"d":"2,412.00"},{"v":0.085,"d":"8.50%"},{"v":4020,"d":"4,020.00"},{"v":0.0875,"d":"8.75%"},{"v":8040,"d":"8,040.00"},{"v":0.09,"d":"9.00%"},{"v":12060,"d":"12,060.00"},{"v":0.095,"d":"9.50%"},{"v":16080,"d":"16,080.00"},{"v":0.1,"d":"10.00%"},{"v":1608,"d":"1,608.00"}]
["1986-11-01",{"v":2412,"d":"2,412.00"},{"v":0.085,"d":"8.50%"},{"v":4020,"d":"4,020.00"},{"v":0.0875,"d":"8.75%"},{"v":8040,"d":"8,040.00"},{"v":0.09,"d":"9.00%"},{"v":12060,"d":"12,060.00"},{"v":0.095,"d":"9.50%"},{"v":16080,"d":"16,080.00"},{"v":0.1,"d":"10.00%"},{"v":1608,"d":"1,608.00"}]
["1986-12-01",{"v":2412,"d":"2,412.00"},{"v":0.085,"d":"8.50%"},{"v":4020,"d":"4,020.00"},{"v":0.0875,"d":"8.75%"},{"v":8040,"d":"8,040.00"},{"v":0.09,"d":"9.00%"},{"v":12060,"d":"12,060.00"},{"v":0.095,"d":"9.50%"},{"v":16080,"d":"16,080.00"},{"v":0.1,"d":"10.00%"},{"v":1608,"d":"1,608.00"}]
["1987-01-01",{"v":2894,"d":"2,894.00"},{"v":0.085,"d":"8.50%"},{"v":4824,"d":"4,824.00"},{"v":0.0875,"d":"8.75%"},{"v":9648,"d":"9,648.00"},{"v":0.09,"d":"9.00%"},{"v":14472,"d":"14,472.00"},{"v":0.095,"d":"9.50%"},{"v":19296,"d":"19,296.00"},{"v":0.1,"d":"10.00%"},{"v":1929.6,"d":"1,929.60"}]
["1987-02-01",{"v":2894,"d":"2,894.00"},{"v":0.085,"d":"8.50%"},{"v":4824,"d":"4,824.00"},{"v":0.0875,"d":"8.75%"},{"v":9648,"d":"9,648.00"},{"v":0.09,"d":"9.00%"},{"v":14472,"d":"14,472.00"},{"v":0.095,"d":"9.50%"},{"v":19296,"d":"19,296.00"},{"v":0.1,"d":"10.00%"},{"v":1929.6,"d":"1,929.60"}]
["1987-03-01",{"v":4104,"d":"4,104.00"},{"v":0.085,"d":"8.50%"},{"v":6840,"d":"6,840.00"},{"v":0.0875,"d":"8.75%"},{"v":13680,"d":"13,680.00"},{"v":0.09,"d":"9.00%"},{"v":20520,"d":"20,520.00"},{"v":0.095,"d":"9.50%"},{"v":27360,"d":"27,360.00"},{"v":0.1,"d":"10.00%"},{"v":2736,"d":"2,736.00"}]
["1987-04-01",{"v":4104,"d":"4,104.00"},{"v":0.085,"d":"8.50%"},{"v":6840,"d":"6,840.00"},{"v":0.0875,"d":"8.75%"},{"v":13680,"d":"13,680.00"},{"v":0.09,"d":"9.00%"},{"v":20520,"d":"20,520.00"},{"v":0.095,"d":"9.50%"},{"v":27360,"d":"27,360.00"},{"v":0.1,"d":"10.00%"},{"v":2736,"d":"2,736.00"}]
["1987-05-01",{"v":4924.8,"d":"4,924.80"},{"v":0.085,"d":"8.50%"},{"v":8208,"d":"8,208.00"},{"v":0.0875,"d":"8.75%"},{"v":16416,"d":"16,416.00"},{"v":0.09,"d":"9.00%"},{"v":24624,"d":"24,624.00"},{"v":0.095,"d":"9.50%"},{"v":32832,"d":"32,832.00"},{"v":0.1,"d":"10.00%"},{"v":3283.2,"d":"3,283.20"}]
["1987-06-01",{"v":5909.76,"d":"5,909.76"},{"v":0.085,"d":"8.50%"},{"v":9849.6,"d":"9,849.60"},{"v":0.0875,"d":"8.75%"},{"v":19699.2,"d":"19,699.20"},{"v":0.09,"d":"9.00%"},{"v":29548.8,"d":"29,548.80"},{"v":0.095,"d":"9.50%"},{"v":39398.4,"d":"39,398.40"},{"v":0.1,"d":"10.00%"},{"v":3939.84,"d":"3,939.84"}]
["1987-07-01",{"v":5909.76,"d":"5,909.76"},{"v":0.085,"d":"8.50%"},{"v":9849.6,"d":"9,849.60"},{"v":0.0875,"d":"8.75%"},{"v":19699.2,"d":"19,699.20"},{"v":0.09,"d":"9.00%"},{"v":29548.8,"d":"29,548.80"},{"v":0.095,"d":"9.50%"},{"v":39398.4,"d":"39,398.40"},{"v":0.1,"d":"10.00%"},{"v":3939.84,"d":"3,939.84"}]
["1987-08-01",{"v":5909.76,"d":"5,909.76"},{"v":0.085,"d":"8.50%"},{"v":9849.6,"d":"9,849.60"},{"v":0.0875,"d":"8.75%"},{"v":19699.2,"d":"19,699.20"},{"v":0.09,"d":"9.00%"},{"v":29548.8,"d":"29,548.80"},{"v":0.095,"d":"9.50%"},{"v":39398.4,"d":"39,398.40"},{"v":0.1,"d":"10.00%"},{"v":3939.84,"d":"3,939.84"}]
["1987-09-01",{"v":6186.93,"d":"6,186.93"},{"v":0.085,"d":"8.50%"},{"v":10311.55,"d":"10,311.55"},{"v":0.0875,"d":"8.75%"},{"v":20623.1,"d":"20,623.10"},{"v":0.09,"d":"9.00%"},{"v":30934.65,"d":"30,934.65"},{"v":0.095,"d":"9.50%"},{"v":41246.2,"d":"41,246.20"},{"v":0.1,"d":"10.00%"},{"v":4124.62,"d":"4,124.62"}]
["1987-10-01",{"v":6477.09,"d":"6,477.09"},{"v":0.085,"d":"8.50%"},{"v":10795.15,"d":"10,795.15"},{"v":0.0875,"d":"8.75%"},{"v":21590.3,"d":"21,590.30"},{"v":0.09,"d":"9.00%"},{"v":32385.45,"d":"32,385.45"},{"v":0.095,"d":"9.50%"},{"v":43180.6,"d":"43,180.60"},{"v":0.1,"d":"10.00%"},{"v":4318.06,"d":"4,318.06"}]
["1987-11-01",{"v":6780.88,"d":"6,780.88"},{"v":0.085,"d":"8.50%"},{"v":11301.45,"d":"11,301.45"},{"v":0.0875,"d":"8.75%"},{"v":22602.9,"d":"22,602.90"},{"v":0.09,"d":"9.00%"},{"v":33904.35,"d":"33,904.35"},{"v":0.095,"d":"9.50%"},{"v":45205.8,"d":"45,205.80"},{"v":0.1,"d":"10.00%"},{"v":4520.58,"d":"4,520.58"}]
["1987-12-01",{"v":7650,"d":"7,650.00"},{"v":0.085,"d":"8.50%"},{"v":12750,"d":"12,750.00"},{"v":0.0875,"d":"8.75%"},{"v":25500,"d":"25,500.00"},{"v":0.09,"d":"9.00%"},{"v":38250,"d":"38,250.00"},{"v":0.095,"d":"9.50%"},{"v":51000,"d":"51,000.00"},{"v":0.1,"d":"10.00%"},{"v":5100,"d":"5,100.00"}]
["1988-01-01",{"v":9180,"d":"9,180.00"},{"v":0.085,"d":"8.50%"},{"v":15300,"d":"15,300.00"},{"v":0.0875,"d":"8.75%"},{"v":30600,"d":"30,600.00"},{"v":0.09,"d":"9.00%"},{"v":54000,"d":"54,000.00"},{"v":0.095,"d":"9.50%"},{"v":61200,"d":"61,200.00"},{"v":0.1,"d":"10.00%"},{"v":6120,"d":"6,120.00"}]
["1988-02-01",{"v":10800,"d":"10,800.00"},{"v":0.085,"d":"8.50%"},{"v":18000,"d":"18,000.00"},{"v":0.0875,"d":"8.75%"},{"v":36000,"d":"36,000.00"},{"v":0.09,"d":"9.00%"},{"v":54000,"d":"54,000.00"},{"v":0.095,"d":"9.50%"},{"v":72000,"d":"72,000.00"},{"v":0.1,"d":"10.00%"},{"v":7200,"d":"7,200.00"}]
["1988-03-01",{"v":12744,"d":"12,744.00"},{"v":0.085,"d":"8.50%"},{"v":21240,"d":"21,240.00"},{"v":0.0875,"d":"8.75%"},{"v":42480,"d":"42,480.00"},{"v":0.09,"d":"9.00%"},{"v":63720,"d":"63,720.00"},{"v":0.095,"d":"9.50%"},{"v":84960,"d":"84,960.00"},{"v":0.1,"d":"10.00%"},{"v":8496,"d":"8,496.00"}]
["1988-04-01",{"v":14796,"d":"14,796.00"},{"v":0.085,"d":"8.50%"},{"v":24660,"d":"24,660.00"},{"v":0.0875,"d":"8.75%"},{"v":49320,"d":"49,320.00"},{"v":0.09,"d":"9.00%"},{"v":73980,"d":"73,980.00"},{"v":0.095,"d":"9.50%"},{"v":98640,"d":"98,640.00"},{"v":0.1,"d":"10.00%"},{"v":9864,"d":"9,864.00"}]
["1988-05-01",{"v":17754,"d":"17,754.00"},{"v":0.085,"d":"8.50%"},{"v":29590,"d":"29,590.00"},{"v":0.0875,"d":"8.75%"},{"v":59180,"d":"59,180.00"},{"v":0.09,"d":"9.00%"},{"v":66770,"d":"66,770.00"},{"v":0.095,"d":"9.50%"},{"v":118360,"d":"118,360.00"},{"v":0.1,"d":"10.00%"},{"v":11836,"d":"11,836.00"}]
["1988-06-01",{"v":20952,"d":"20,952.00"},{"v":0.085,"d":"8.50%"},{"v":34920,"d":"34,920.00"},{"v":0.0875,"d":"8.75%"},{"v":69840,"d":"69,840.00"},{"v":0.09,"d":"9.00%"},{"v":104760,"d":"104,760.00"},{"v":0.095,"d":"9.50%"},{"v":139680,"d":"139,680.00"},{"v":0.1,"d":"10.00%"},{"v":13968,"d":"13,968.00"}]
["1988-07-01",{"v":25128,"d":"25,128.00"},{"v":0.085,"d":"8.50%"},{"v":41880,"d":"41,880.00"},{"v":0.0875,"d":"8.75%"},{"v":83760,"d":"83,760.00"},{"v":0.09,"d":"9.00%"},{"v":125640,"d":"125,640.00"},{"v":0.095,"d":"9.50%"},{"v":167520,"d":"167,520.00"},{"v":0.1,"d":"10.00%"},{"v":16752,"d":"16,752.00"}]
["1988-08-01",{"v":31932,"d":"31,932.00"},{"v":0.085,"d":"8.50%"},{"v":52320,"d":"52,320.00"},{"v":0.0875,"d":"8.75%"},{"v":104640,"d":"104,640.00"},{"v":0.09,"d":"9.00%"},{"v":156960,"d":"156,960.00"},{"v":0.095,"d":"9.50%"},{"v":209280,"d":"209,280.00"},{"v":0.1,"d":"10.00%"},{"v":20928,"d":"20,928.00"}]
["1988-09-01",{"v":38106,"d":"38,106.00"},{"v":0.085,"d":"8.50%"},{"v":63510,"d":"63,510.00"},{"v":0.0875,"d":"8.75%"},{"v":127020,"d":"127,020.00"},{"v":0.09,"d":"9.00%"},{"v":190530,"d":"190,530.00"},{"v":0.095,"d":"9.50%"},{"v":254040,"d":"254,040.00"},{"v":0.1,"d":"10.00%"},{"v":25404,"d":"25,404.00"}]
["1988-10-01",{"v":47268,"d":"47,268.00"},{"v":0.085,"d":"8.50%"},{"v":78780,"d":"78,780.00"},{"v":0.0875,"d":"8.75%"},{"v":157560,"d":"157,560.00"},{"v":0.09,"d":"9.00%"},{"v":236340,"d":"236,340.00"},{"v":0.095,"d":"9.50%"},{"v":315120,"d":"315,120.00"},{"v":0.1,"d":"10.00%"},{"v":31512,"d":"31,512.00"}]
["1988-11-01",{"v":61428,"d":"61,428.00"},{"v":0.085,"d":"8.50%"},{"v":102360,"d":"102,360.00"},{"v":0.0875,"d":"8.75%"},{"v":204760,"d":"204,760.00"},{"v":0.09,"d":"9.00%"},{"v":307140,"d":"307,140.00"},{"v":0.095,"d":"9.50%"},{"v":409520,"d":"409,520.00"},{"v":0.1,"d":"10.00%"},{"v":40952,"d":"40,952.00"}]
["1988-12-01",{"v":76785,"d":"76,785.00"},{"v":0.085,"d":"8.50%"},{"v":127975,"d":"127,975.00"},{"v":0.0875,"d":"8.75%"},{"v":255950,"d":"255,950.00"},{"v":0.09,"d":"9.00%"},{"v":383925,"d":"383,925.00"},{"v":0.095,"d":"9.50%"},{"v":511900,"d":"511,900.00"},{"v":0.1,"d":"10.00%"},{"v":51190,"d":"51,190.00"}]
["1989-01-01",95.99,{"v":0.085,"d":"8.50%"},159.33,{"v":0.0875,"d":"8.75%"},318.66,{"v":0.09,"d":"9.00%"},477.99,{"v":0.095,"d":"9.50%"},673.32,{"v":0.1,"d":"10.00%"},{"v":67.33200000000001,"d":"67.33"}]
["1989-02-01",110.22,{"v":0.085,"d":"8.50%"},{"v":183.7,"d":"183.70"},{"v":0.0875,"d":"8.75%"},{"v":367.4,"d":"367.40"},{"v":0.09,"d":"9.00%"},{"v":551.1,"d":"551.10"},{"v":0.095,"d":"9.50%"},{"v":734.8,"d":"734.80"},{"v":0.1,"d":"10.00%"},73.48]
["1989-03-01",110.22,{"v":0.085,"d":"8.50%"},{"v":183.7,"d":"183.70"},{"v":0.0875,"d":"8.75%"},{"v":367.4,"d":"367.40"},{"v":0.09,"d":"9.00%"},{"v":551.1,"d":"551.10"},{"v":0.095,"d":"9.50%"},{"v":734.8,"d":"734.80"},{"v":0.1,"d":"10.00%"},73.48]
["1989-04-01",110.22,{"v":0.085,"d":"8.50%"},{"v":183.7,"d":"183.70"},{"v":0.0875,"d":"8.75%"},{"v":367.4,"d":"367.40"},{"v":0.09,"d":"9.00%"},{"v":551.1,"d":"551.10"},{"v":0.095,"d":"9.50%"},{"v":734.8,"d":"734.80"},{"v":0.1,"d":"10.00%"},73.48]
["1989-05-01",{"v":140.4,"d":"140.40"},{"v":0.085,"d":"8.50%"},{"v":234,"d":"234.00"},{"v":0.0875,"d":"8.75%"},{"v":468,"d":"468.00"},{"v":0.09,"d":"9.00%"},{"v":702,"d":"702.00"},{"v":0.095,"d":"9.50%"},{"v":936,"d":"936.00"},{"v":0.1,"d":"10.00%"},{"v":93.6,"d":"93.60"}]
["1989-06-01",{"v":140.4,"d":"140.40"},{"v":0.085,"d":"8.50%"},{"v":234,"d":"234.00"},{"v":0.0875,"d":"8.75%"},{"v":468,"d":"468.00"},{"v":0.09,"d":"9.00%"},{"v":702,"d":"702.00"},{"v":0.095,"d":"9.50%"},{"v":936,"d":"936.00"},{"v":0.1,"d":"10.00%"},{"v":93.6,"d":"93.60"}]
["1989-07-01",{"v":450,"d":"450.00"},{"v":0.08,"d":"8.00%"},{"v":750,"d":"750.00"},{"v":0.0875,"d":"8.75%"},{"v":1050,"d":"1,050.00"},{"v":0.09,"d":"9.00%"},{"v":1350,"d":"1,350.00"},{"v":0.095,"d":"9.50%"},{"v":1500,"d":"1,500.00"},{"v":0.1,"d":"10.00%"},{"v":150,"d":"150.00"}]
["1989-08-01",579.42,{"v":0.08,"d":"8.00%"},{"v":965.7,"d":"965.70"},{"v":0.0875,"d":"8.75%"},{"v":1351.98,"d":"1,351.98"},{"v":0.09,"d":"9.00%"},{"v":1738.26,"d":"1,738.26"},{"v":0.095,"d":"9.50%"},{"v":1931.4,"d":"1,931.40"},{"v":0.1,"d":"10.00%"},193.14]
["1989-09-01",749.43,{"v":0.08,"d":"8.00%"},{"v":1249.04,"d":"1,249.04"},{"v":0.09,"d":"9.00%"},249.07,{"v":0.1,"d":"10.00%"},249.07,{"v":0.1,"d":"10.00%"},249.07,{"v":0.1,"d":"10.00%"},{"v":24.907,"d":"24.91"}]
["1989-10-01",{"v":1018.84,"d":"1,018.84"},{"v":0.08,"d":"8.00%"},{"v":1698.07,"d":"1,698.07"},{"v":0.09,"d":"9.00%"},{"v":3396.13,"d":"3,396.13"},{"v":0.1,"d":"10.00%"},{"v":3396.13,"d":"3,396.13"},{"v":0.1,"d":"10.00%"},{"v":3396.13,"d":"3,396.13"},{"v":0.1,"d":"10.00%"},{"v":339.61300000000006,"d":"339.61"}]
["1989-11-01",{"v":1402.13,"d":"1,402.13"},{"v":0.08,"d":"8.00%"},{"v":2336.88,"d":"2,336.88"},{"v":0.09,"d":"9.00%"},{"v":4673.75,"d":"4,673.75"},{"v":0.1,"d":"10.00%"},{"v":4673.75,"d":"4,673.75"},{"v":0.1,"d":"10.00%"},{"v":4673.75,"d":"4,673.75"},{"v":0.1,"d":"10.00%"},{"v":467.375,"d":"467.38"}]
["1989-12-01",{"v":1982.89,"d":"1,982.89"},{"v":0.08,"d":"8.00%"},{"v":3304.81,"d":"3,304.81"},{"v":0.09,"d":"9.00%"},{"v":6609.62,"d":"6,609.62"},{"v":0.1,"d":"10.00%"},{"v":6609.62,"d":"6,609.62"},{"v":0.1,"d":"10.00%"},{"v":6609.62,"d":"6,609.62"},{"v":0.1,"d":"10.00%"},{"v":660.962,"d":"660.96"}]
["1990-01-01",{"v":3044.72,"d":"3,044.72"},{"v":0.08,"d":"8.00%"},{"v":5074.54,"d":"5,074.54"},{"v":0.09,"d":"9.00%"},{"v":10149.07,"d":"10,149.07"},{"v":0.1,"d":"10.00%"},{"v":10149.07,"d":"10,149.07"},{"v":0.1,"d":"10.00%"},{"v":10149.07,"d":"10,149.07"},{"v":0.1,"d":"10.00%"},{"v":1014.907,"d":"1,014.91"}]
["1990-02-01",{"v":4753.11,"d":"4,753.11"},{"v":0.08,"d":"8.00%"},{"v":7921.86,"d":"7,921.86"},{"v":0.09,"d":"9.00%"},{"v":15843.71,"d":"15,843.71"},{"v":0.1,"d":"10.00%"},{"v":15843.71,"d":"15,843.71"},{"v":0.1,"d":"10.00%"},{"v":15843.71,"d":"15,843.71"},{"v":0.1,"d":"10.00%"},{"v":1584.371,"d":"1,584.37"}]
["1990-03-01",{"v":8212.42,"d":"8,212.42"},{"v":0.08,"d":"8.00%"},{"v":13687.39,"d":"13,687.39"},{"v":0.09,"d":"9.00%"},{"v":27374.76,"d":"27,374.76"},{"v":0.1,"d":"10.00%"},{"v":27374.76,"d":"27,374.76"},{"v":0.1,"d":"10.00%"},{"v":27374.76,"d":"27,374.76"},{"v":0.1,"d":"10.00%"},{"v":2737.476,"d":"2,737.48"}]
["1990-04-01",{"v":8212.42,"d":"8,212.42"},{"v":0.08,"d":"8.00%"},{"v":13687.39,"d":"13,687.39"},{"v":0.09,"d":"9.00%"},{"v":27374.76,"d":"27,374.76"},{"v":0.1,"d":"10.00%"},{"v":27374.76,"d":"27,374.76"},{"v":0.1,"d":"10.00%"},{"v":27374.76,"d":"27,374.76"},{"v":0.1,"d":"10.00%"},{"v":2737.476,"d":"2,737.48"}]
["1990-05-01",{"v":8212.42,"d":"8,212.42"},{"v":0.08,"d":"8.00%"},{"v":13687.39,"d":"13,687.39"},{"v":0.09,"d":"9.00%"},{"v":27374.76,"d":"27,374.76"},{"v":0.1,"d":"10.00%"},{"v":27374.76,"d":"27,374.76"},{"v":0.1,"d":"10.00%"},{"v":27374.76,"d":"27,374.76"},{"v":0.1,"d":"10.00%"},{"v":2737.476,"d":"2,737.48"}]
["1990-06-01",{"v":8654.28,"d":"8,654.28"},{"v":0.08,"d":"8.00%"},{"v":14423.8,"d":"14,423.80"},{"v":0.09,"d":"9.00%"},{"v":28847.52,"d":"28,847.52"},{"v":0.1,"d":"10.00%"},{"v":28847.52,"d":"28,847.52"},{"v":0.1,"d":"10.00%"},{"v":28847.52,"d":"28,847.52"},{"v":0.1,"d":"10.00%"},{"v":2884.7520000000004,"d":"2,884.75"}]
["1990-07-01",{"v":11003.02,"d":"11,003.02"},{"v":0.08,"d":"8.00%"},{"v":18338.37,"d":"18,338.37"},{"v":0.09,"d":"9.00%"},{"v":36676.74,"d":"36,676.74"},{"v":0.1,"d":"10.00%"},{"v":36676.74,"d":"36,676.74"},{"v":0.1,"d":"10.00%"},{"v":36676.74,"d":"36,676.74"},{"v":0.1,"d":"10.00%"},{"v":3667.674,"d":"3,667.67"}]
["1990-08-01",{"v":11003.02,"d":"11,003.02"},{"v":0.08,"d":"8.00%"},{"v":18338.37,"d":"18,338.37"},{"v":0.09,"d":"9.00%"},{"v":36676.74,"d":"36,676.74"},{"v":0.1,"d":"10.00%"},{"v":36676.74,"d":"36,676.74"},{"v":0.1,"d":"10.00%"},{"v":36676.74,"d":"36,676.74"},{"v":0.1,"d":"10.00%"},{"v":3667.674,"d":"3,667.67"}]
["1990-09-01",{"v":11673.1,"d":"11,673.10"},{"v":0.08,"d":"8.00%"},{"v":19455.17,"d":"19,455.17"},{"v":0.09,"d":"9.00%"},{"v":38910.35,"d":"38,910.35"},{"v":0.1,"d":"10.00%"},{"v":38910.35,"d":"38,910.35"},{"v":0.1,"d":"10.00%"},{"v":38910.35,"d":"38,910.35"},{"v":0.1,"d":"10.00%"},{"v":3891.035,"d":"3,891.04"}]
["1990-10-01",{"v":14413.73,"d":"14,413.73"},{"v":0.08,"d":"8.00%"},{"v":24022.89,"d":"24,022.89"},{"v":0.09,"d":"9.00%"},{"v":48045.78,"d":"48,045.78"},{"v":0.1,"d":"10.00%"},{"v":48045.78,"d":"48,045.78"},{"v":0.1,"d":"10.00%"},{"v":48045.78,"d":"48,045.78"},{"v":0.1,"d":"10.00%"},{"v":4804.578,"d":"4,804.58"}]
["1990-11-01",{"v":18685.97,"d":"18,685.97"},{"v":0.08,"d":"8.00%"},{"v":31143.28,"d":"31,143.28"},{"v":0.09,"d":"9.00%"},{"v":62286.55,"d":"62,286.55"},{"v":0.1,"d":"10.00%"},{"v":62286.55,"d":"62,286.55"},{"v":0.1,"d":"10.00%"},{"v":62286.55,"d":"62,286.55"},{"v":0.1,"d":"10.00%"},{"v":6228.655000000001,"d":"6,228.66"}]
["1990-12-01",{"v":19823.94,"d":"19,823.94"},{"v":0.08,"d":"8.00%"},{"v":33039.9,"d":"33,039.90"},{"v":0.09,"d":"9.00%"},{"v":66079.76,"d":"66,079.76"},{"v":0.1,"d":"10.00%"},{"v":66079.76,"d":"66,079.76"},{"v":0.1,"d":"10.00%"},{"v":66079.76,"d":"66,079.76"},{"v":0.1,"d":"10.00%"},{"v":6607.976,"d":"6,607.98"}]
["1991-01-01",{"v":27650.43,"d":"27,650.43"},{"v":0.08,"d":"8.00%"},{"v":46084.06,"d":"46,084.06"},{"v":0.09,"d":"9.00%"},{"v":92168.11,"d":"92,168.11"},{"v":0.1,"d":"10.00%"},{"v":92168.11,"d":"92,168.11"},{"v":0.1,"d":"10.00%"},{"v":92168.11,"d":"92,168.11"},{"v":0.1,"d":"10.00%"},{"v":9216.811,"d":"9,216.81"}]
["1991-02-01",{"v":35658,"d":"35,658.00"},{"v":0.08,"d":"8.00%"},{"v":59430.01,"d":"59,430.01"},{"v":0.09,"d":"9.00%"},{"v":118859.99,"d":"118,859.99"},{"v":0.1,"d":"10.00%"},{"v":118859.99,"d":"118,859.99"},{"v":0.1,"d":"10.00%"},{"v":118859.99,"d":"118,859.99"},{"v":0.1,"d":"10.00%"},{"v":11885.999000000002,"d":"11,886.00"}]
["1991-03-01",{"v":38136.24,"d":"38,136.24"},{"v":0.08,"d":"8.00%"},{"v":63650.4,"d":"63,650.40"},{"v":0.09,"d":"9.00%"},{"v":127120.8,"d":"127,120.80"},{"v":0.1,"d":"10.00%"},{"v":127120.8,"d":"127,120.80"},{"v":0.1,"d":"10.00%"},{"v":127120.8,"d":"127,120.80"},{"v":0.1,"d":"10.00%"},{"v":12712.08,"d":"12,712.08"}]
["1991-04-01",{"v":38136.24,"d":"38,136.24"},{"v":0.08,"d":"8.00%"},{"v":63650.4,"d":"63,650.40"},{"v":0.09,"d":"9.00%"},{"v":127120.8,"d":"127,120.80"},{"v":0.1,"d":"10.00%"},{"v":127120.8,"d":"127,120.80"},{"v":0.1,"d":"10.00%"},{"v":127120.8,"d":"127,120.80"},{"v":0.1,"d":"10.00%"},{"v":12712.08,"d":"12,712.08"}]
["1991-05-01",{"v":38136.24,"d":"38,136.24"},{"v":0.08,"d":"8.00%"},{"v":63650.4,"d":"63,650.40"},{"v":0.09,"d":"9.00%"},{"v":127120.8,"d":"127,120.80"},{"v":0.1,"d":"10.00%"},{"v":127120.8,"d":"127,120.80"},{"v":0.1,"d":"10.00%"},{"v":127120.8,"d":"127,120.80"},{"v":0.1,"d":"10.00%"},{"v":12712.08,"d":"12,712.08"}]
["1991-06-01",{"v":38136.24,"d":"38,136.24"},{"v":0.08,"d":"8.00%"},{"v":63650.4,"d":"63,650.40"},{"v":0.09,"d":"9.00%"},{"v":127120.8,"d":"127,120.80"},{"v":0.1,"d":"10.00%"},{"v":127120.8,"d":"127,120.80"},{"v":0.1,"d":"10.00%"},{"v":127120.8,"d":"127,120.80"},{"v":0.1,"d":"10.00%"},{"v":12712.08,"d":"12,712.08"}]
["1991-07-01",{"v":38136.24,"d":"38,136.24"},{"v":0.08,"d":"8.00%"},{"v":63650.4,"d":"63,650.40"},{"v":0.09,"d":"9.00%"},{"v":127120.8,"d":"127,120.80"},{"v":0.1,"d":"10.00%"},{"v":127120.8,"d":"127,120.80"},{"v":0.1,"d":"10.00%"},{"v":127120.8,"d":"127,120.80"},{"v":0.1,"d":"10.00%"},{"v":12712.08,"d":"12,712.08"}]
["1991-08-01",{"v":51000,"d":"51,000.00"},{"v":0.08,"d":"8.00%"},{"v":85000,"d":"85,000.00"},{"v":0.09,"d":"9.00%"},{"v":170000,"d":"170,000.00"},{"v":0.1,"d":"10.00%"},{"v":170000,"d":"170,000.00"},{"v":0.1,"d":"10.00%"},{"v":170000,"d":"170,000.00"},{"v":0.1,"d":"10.00%"},{"v":17000,"d":"17,000.00"}]
["1991-09-01",{"v":126000.6,"d":"126,000.60"},{"v":0.08,"d":"8.00%"},{"v":210001,"d":"210,001.00"},{"v":0.09,"d":"9.00%"},{"v":420002,"d":"420,002.00"},{"v":0.1,"d":"10.00%"},{"v":420002,"d":"420,002.00"},{"v":0.1,"d":"10.00%"},{"v":420002,"d":"420,002.00"},{"v":0.1,"d":"10.00%"},{"v":42000.2,"d":"42,000.20"}]
["1991-10-01",{"v":126000.6,"d":"126,000.60"},{"v":0.08,"d":"8.00%"},{"v":210001,"d":"210,001.00"},{"v":0.09,"d":"9.00%"},{"v":420002,"d":"420,002.00"},{"v":0.1,"d":"10.00%"},{"v":420002,"d":"420,002.00"},{"v":0.1,"d":"10.00%"},{"v":420002,"d":"420,002.00"},{"v":0.1,"d":"10.00%"},{"v":42000.2,"d":"42,000.20"}]
["1991-11-01",{"v":126000.6,"d":"126,000.60"},{"v":0.08,"d":"8.00%"},{"v":210001,"d":"210,001.00"},{"v":0.09,"d":"9.00%"},{"v":420002,"d":"420,002.00"},{"v":0.1,"d":"10.00%"},{"v":420002,"d":"420,002.00"},{"v":0.1,"d":"10.00%"},{"v":420002,"d":"420,002.00"},{"v":0.1,"d":"10.00%"},{"v":42000.2,"d":"42,000.20"}]
["1991-12-01",{"v":126000.6,"d":"126,000.60"},{"v":0.08,"d":"8.00%"},{"v":210001,"d":"210,001.00"},{"v":0.09,"d":"9.00%"},{"v":420002,"d":"420,002.00"},{"v":0.1,"d":"10.00%"},{"v":420002,"d":"420,002.00"},{"v":0.1,"d":"10.00%"},{"v":420002,"d":"420,002.00"},{"v":0.1,"d":"10.00%"},{"v":42000.2,"d":"42,000.20"}]
["1992-01-01",{"v":276978.83,"d":"276,978.83"},{"v":0.08,"d":"8.00%"},{"v":461631.38,"d":"461,631.38"},{"v":0.09,"d":"9.00%"},{"v":923262.76,"d":"923,262.76"},{"v":0.1,"d":"10.00%"},{"v":923262.76,"d":"923,262.76"},{"v":0.1,"d":"10.00%"},{"v":923262.76,"d":"923,262.76"},{"v":0.1,"d":"10.00%"},{"v":92326.27600000001,"d":"92,326.28"}]
["1992-02-01",{"v":276978.83,"d":"276,978.83"},{"v":0.08,"d":"8.00%"},{"v":461631.38,"d":"461,631.38"},{"v":0.09,"d":"9.00%"},{"v":923262.76,"d":"923,262.76"},{"v":0.1,"d":"10.00%"},{"v":923262.76,"d":"923,262.76"},{"v":0.1,"d":"10.00%"},{"v":923262.76,"d":"923,262.76"},{"v":0.1,"d":"10.00%"},{"v":92326.27600000001,"d":"92,326.28"}]
["1992-03-01",{"v":276978.83,"d":"276,978.83"},{"v":0.08,"d":"8.00%"},{"v":461631.38,"d":"461,631.38"},{"v":0.09,"d":"9.00%"},{"v":923262.76,"d":"923,262.76"},{"v":0.1,"d":"10.00%"},{"v":923262.76,"d":"923,262.76"},{"v":0.1,"d":"10.00%"},{"v":923262.76,"d":"923,262.76"},{"v":0.1,"d":"10.00%"},{"v":92326.27600000001,"d":"92,326.28"}]
["1992-04-01",{"v":276978.83,"d":"276,978.83"},{"v":0.08,"d":"8.00%"},{"v":461631.38,"d":"461,631.38"},{"v":0.09,"d":"9.00%"},{"v":923262.76,"d":"923,262.76"},{"v":0.1,"d":"10.00%"},{"v":923262.76,"d":"923,262.76"},{"v":0.1,"d":"10.00%"},{"v":923262.76,"d":"923,262.76"},{"v":0.1,"d":"10.00%"},{"v":92326.27600000001,"d":"92,326.28"}]
["1992-05-01",{"v":638052.75,"d":"638,052.75"},{"v":0.08,"d":"8.00%"},{"v":1063421.25,"d":"1,063,421.25"},{"v":0.09,"d":"9.00%"},{"v":2126842.49,"d":"2,126,842.49"},{"v":0.1,"d":"10.00%"},{"v":2126842.49,"d":"2,126,842.49"},{"v":0.1,"d":"10.00%"},{"v":2126842.49,"d":"2,126,842.49"},{"v":0.1,"d":"10.00%"},{"v":212684.24900000004,"d":"212,684.25"}]
["1992-06-01",{"v":638052.75,"d":"638,052.75"},{"v":0.08,"d":"8.00%"},{"v":1063421.25,"d":"1,063,421.25"},{"v":0.09,"d":"9.00%"},{"v":2126842.49,"d":"2,126,842.49"},{"v":0.1,"d":"10.00%"},{"v":2126842.49,"d":"2,126,842.49"},{"v":0.1,"d":"10.00%"},{"v":2126842.49,"d":"2,126,842.49"},{"v":0.1,"d":"10.00%"},{"v":212684.24900000004,"d":"212,684.25"}]
["1992-07-01",{"v":638052.75,"d":"638,052.75"},{"v":0.08,"d":"8.00%"},{"v":1063421.25,"d":"1,063,421.25"},{"v":0.09,"d":"9.00%"},{"v":2126842.49,"d":"2,126,842.49"},{"v":0.1,"d":"10.00%"},{"v":2126842.49,"d":"2,126,842.49"},{"v":0.1,"d":"10.00%"},{"v":2126842.49,"d":"2,126,842.49"},{"v":0.1,"d":"10.00%"},{"v":212684.24900000004,"d":"212,684.25"}]
["1992-08-01",{"v":638052.75,"d":"638,052.75"},{"v":0.08,"d":"8.00%"},{"v":1063421.25,"d":"1,063,421.25"},{"v":0.09,"d":"9.00%"},{"v":2126842.49,"d":"2,126,842.49"},{"v":0.1,"d":"10.00%"},{"v":2126842.49,"d":"2,126,842.49"},{"v":0.1,"d":"10.00%"},{"v":2126842.49,"d":"2,126,842.49"},{"v":0.1,"d":"10.00%"},{"v":212684.24900000004,"d":"212,684.25"}]
["1992-09-01",{"v":1434259,"d":"1,434,259.00"},{"v":0.08,"d":"8.00%"},{"v":2390431.66,"d":"2,390,431.66"},{"v":0.09,"d":"9.00%"},{"v":4780863.3,"d":"4,780,863.30"},{"v":0.1,"d":"10.00%"},{"v":4780863.3,"d":"4,780,863.30"},{"v":0.1,"d":"10.00%"},{"v":4780863.3,"d":"4,780,863.30"},{"v":0.1,"d":"10.00%"},{"v":478086.33,"d":"478,086.33"}]
["1992-10-01",{"v":1434259,"d":"1,434,259.00"},{"v":0.08,"d":"8.00%"},{"v":2390431.66,"d":"2,390,431.66"},{"v":0.09,"d":"9.00%"},{"v":4780863.3,"d":"4,780,863.30"},{"v":0.1,"d":"10.00%"},{"v":4780863.3,"d":"4,780,863.30"},{"v":0.1,"d":"10.00%"},{"v":4780863.3,"d":"4,780,863.30"},{"v":0.1,"d":"10.00%"},{"v":478086.33,"d":"478,086.33"}]
["1992-11-01",{"v":1434259,"d":"1,434,259.00"},{"v":0.08,"d":"8.00%"},{"v":2390431.66,"d":"2,390,431.66"},{"v":0.09,"d":"9.00%"},{"v":4780863.3,"d":"4,780,863.30"},{"v":0.1,"d":"10.00%"},{"v":4780863.3,"d":"4,780,863.30"},{"v":0.1,"d":"10.00%"},{"v":4780863.3,"d":"4,780,863.30"},{"v":0.1,"d":"10.00%"},{"v":478086.33,"d":"478,086.33"}]
["1992-12-01",{"v":1434259,"d":"1,434,259.00"},{"v":0.08,"d":"8.00%"},{"v":2390431.66,"d":"2,390,431.66"},{"v":0.09,"d":"9.00%"},{"v":4780863.3,"d":"4,780,863.30"},{"v":0.1,"d":"10.00%"},{"v":4780863.3,"d":"4,780,863.30"},{"v":0.1,"d":"10.00%"},{"v":4780863.3,"d":"4,780,863.30"},{"v":0.1,"d":"10.00%"},{"v":478086.33,"d":"478,086.33"}]
["1993-01-01",{"v":3459616.19,"d":"3,459,616.19"},{"v":0.08,"d":"8.00%"},{"v":5766027.14,"d":"5,766,027.14"},{"v":0.09,"d":"9.00%"},{"v":11532054.23,"d":"11,532,054.23"},{"v":0.1,"d":"10.00%"},{"v":11532054.23,"d":"11,532,054.23"},{"v":0.1,"d":"10.00%"},{"v":11532054.23,"d":"11,532,054.23"},{"v":0.1,"d":"10.00%"},{"v":1153205.4230000002,"d":"1,153,205.42"}]
["1993-02-01",{"v":3459616.19,"d":"3,459,616.19"},{"v":0.08,"d":"8.00%"},{"v":5766027.14,"d":"5,766,027.14"},{"v":0.09,"d":"9.00%"},{"v":11532054.23,"d":"11,532,054.23"},{"v":0.1,"d":"10.00%"},{"v":11532054.23,"d":"11,532,054.23"},{"v":0.1,"d":"10.00%"},{"v":11532054.23,"d":"11,532,054.23"},{"v":0.1,"d":"10.00%"},{"v":1153205.4230000002,"d":"1,153,205.42"}]
["1993-03-01",{"v":4728257.59,"d":"4,728,257.59"},{"v":0.08,"d":"8.00%"},{"v":7880429.29,"d":"7,880,429.29"},{"v":0.09,"d":"9.00%"},{"v":15760858.52,"d":"15,760,858.52"},{"v":0.1,"d":"10.00%"},{"v":15760858.52,"d":"15,760,858.52"},{"v":0.1,"d":"10.00%"},{"v":15760858.52,"d":"15,760,858.52"},{"v":0.1,"d":"10.00%"},{"v":1576085.852,"d":"1,576,085.85"}]
["1993-04-01",{"v":4728257.59,"d":"4,728,257.59"},{"v":0.08,"d":"8.00%"},{"v":7880429.29,"d":"7,880,429.29"},{"v":0.09,"d":"9.00%"},{"v":15760858.52,"d":"15,760,858.52"},{"v":0.1,"d":"10.00%"},{"v":15760858.52,"d":"15,760,858.52"},{"v":0.1,"d":"10.00%"},{"v":15760858.52,"d":"15,760,858.52"},{"v":0.1,"d":"10.00%"},{"v":1576085.852,"d":"1,576,085.85"}]
["1993-05-01",{"v":9064419.69,"d":"9,064,419.69"},{"v":0.08,"d":"8.00%"},{"v":15107366.1,"d":"15,107,366.10"},{"v":0.09,"d":"9.00%"},{"v":30214732.09,"d":"30,214,732.09"},{"v":0.1,"d":"10.00%"},{"v":30214732.09,"d":"30,214,732.09"},{"v":0.1,"d":"10.00%"},{"v":30214732.09,"d":"30,214,732.09"},{"v":0.1,"d":"10.00%"},{"v":3021473.2090000003,"d":"3,021,473.21"}]
["1993-06-01",{"v":9064419.69,"d":"9,064,419.69"},{"v":0.08,"d":"8.00%"},{"v":15107366.1,"d":"15,107,366.10"},{"v":0.09,"d":"9.00%"},{"v":30214732.09,"d":"30,214,732.09"},{"v":0.1,"d":"10.00%"},{"v":30214732.09,"d":"30,214,732.09"},{"v":0.1,"d":"10.00%"},{"v":30214732.09,"d":"30,214,732.09"},{"v":0.1,"d":"10.00%"},{"v":3021473.2090000003,"d":"3,021,473.21"}]
["1993-07-01",{"v":12731793.25,"d":"12,731,793.25"},{"v":0.08,"d":"8.00%"},{"v":21219655.35,"d":"21,219,655.35"},{"v":0.09,"d":"9.00%"},{"v":42439310.55,"d":"42,439,310.55"},{"v":0.1,"d":"10.00%"},{"v":42439310.55,"d":"42,439,310.55"},{"v":0.1,"d":"10.00%"},{"v":42439310.55,"d":"42,439,310.55"},{"v":0.1,"d":"10.00%"},{"v":4243931.055,"d":"4,243,931.06"}]
["1993-08-01",{"v":15183.93,"d":"15,183.93"},{"v":0.077,"d":"7.70%"},{"v":25306.55,"d":"25,306.55"},{"v":0.0877,"d":"8.77%"},{"v":50613.12,"d":"50,613.12"},{"v":0.0977,"d":"9.77%"},{"v":50613.12,"d":"50,613.12"},{"v":0.0977,"d":"9.77%"},{"v":50613.12,"d":"50,613.12"},{"v":0.0977,"d":"9.77%"},{"v":4944.901824,"d":"4,944.90"}]
["1993-09-01",{"v":25924.48,"d":"25,924.48"},{"v":0.077,"d":"7.70%"},{"v":43207.47,"d":"43,207.47"},{"v":0.0877,"d":"8.77%"},{"v":86414.97,"d":"86,414.97"},{"v":0.0977,"d":"9.77%"},{"v":86414.97,"d":"86,414.97"},{"v":0.0977,"d":"9.77%"},{"v":86414.97,"d":"86,414.97"},{"v":0.0977,"d":"9.77%"},{"v":8442.742569,"d":"8,442.74"}]
["1993-10-01",{"v":32449.67,"d":"32,449.67"},{"v":0.077,"d":"7.70%"},{"v":54082.79,"d":"54,082.79"},{"v":0.0877,"d":"8.77%"},{"v":108165.62,"d":"108,165.62"},{"v":0.0977,"d":"9.77%"},{"v":108165.62,"d":"108,165.62"},{"v":0.0977,"d":"9.77%"},{"v":108165.62,"d":"108,165.62"},{"v":0.0977,"d":"9.77%"},{"v":10567.781073999999,"d":"10,567.78"}]
["1993-11-01",{"v":40536.13,"d":"40,536.13"},{"v":0.077,"d":"7.70%"},{"v":67560.22,"d":"67,560.22"},{"v":0.0877,"d":"8.77%"},{"v":135120.49,"d":"135,120.49"},{"v":0.0977,"d":"9.77%"},{"v":135120.49,"d":"135,120.49"},{"v":0.0977,"d":"9.77%"},{"v":135120.49,"d":"135,120.49"},{"v":0.0977,"d":"9.77%"},{"v":13201.271872999998,"d":"13,201.27"}]
["1993-12-01",{"v":50625.57,"d":"50,625.57"},{"v":0.077,"d":"7.70%"},{"v":84375.96,"d":"84,375.96"},{"v":0.0877,"d":"8.77%"},{"v":168751.98,"d":"168,751.98"},{"v":0.0977,"d":"9.77%"},{"v":168751.98,"d":"168,751.98"},{"v":0.0977,"d":"9.77%"},{"v":168751.98,"d":"168,751.98"},{"v":0.0977,"d":"9.77%"},{"v":16487.068446,"d":"16,487.07"}]
["1994-01-01",{"v":88738.58,"d":"88,738.58"},{"v":0.077,"d":"7.70%"},{"v":147897.64,"d":"147,897.64"},{"v":0.0877,"d":"8.77%"},{"v":295795.39,"d":"295,795.39"},{"v":0.0977,"d":"9.77%"},{"v":295795.39,"d":"295,795.39"},{"v":0.0977,"d":"9.77%"},{"v":295795.39,"d":"295,795.39"},{"v":0.0977,"d":"9.77%"},{"v":28899.209603,"d":"28,899.21"}]
["1994-02-01",{"v":115582.02,"d":"115,582.02"},{"v":0.077,"d":"7.70%"},{"v":192636.7,"d":"192,636.70"},{"v":0.0877,"d":"8.77%"},{"v":385273.5,"d":"385,273.50"},{"v":0.0977,"d":"9.77%"},{"v":385273.5,"d":"385,273.50"},{"v":0.0977,"d":"9.77%"},{"v":385273.5,"d":"385,273.50"},{"v":0.0977,"d":"9.77%"},{"v":37641.220949999995,"d":"37,641.22"}]
["1994-03-01",174.86,{"v":0.077,"d":"7.70%"},291.43,{"v":0.0877,"d":"8.77%"},582.86,{"v":0.0977,"d":"9.77%"},582.86,{"v":0.0977,"d":"9.77%"},582.86,{"v":0.0977,"d":"9.77%"},{"v":56.945422,"d":"56.95"}]
["1994-04-01",174.86,{"v":0.077,"d":"7.70%"},291.43,{"v":0.0877,"d":"8.77%"},582.86,{"v":0.0977,"d":"9.77%"},582.86,{"v":0.0977,"d":"9.77%"},582.86,{"v":0.0977,"d":"9.77%"},{"v":56.945422,"d":"56.95"}]
["1994-05-01",174.86,{"v":0.077,"d":"7.70%"},291.43,{"v":0.0877,"d":"8.77%"},582.86,{"v":0.0977,"d":"9.77%"},582.86,{"v":0.0977,"d":"9.77%"},582.86,{"v":0.0977,"d":"9.77%"},{"v":56.945422,"d":"56.95"}]
["1994-06-01",174.86,{"v":0.077,"d":"7.70%"},291.43,{"v":0.0877,"d":"8.77%"},582.86,{"v":0.0977,"d":"9.77%"},582.86,{"v":0.0977,"d":"9.77%"},582.86,{"v":0.0977,"d":"9.77%"},{"v":56.945422,"d":"56.95"}]
["1994-07-01",174.86,{"v":0.077,"d":"7.70%"},291.43,{"v":0.0877,"d":"8.77%"},582.86,{"v":0.0977,"d":"9.77%"},582.86,{"v":0.0977,"d":"9.77%"},582.86,{"v":0.0977,"d":"9.77%"},{"v":56.945422,"d":"56.95"}]
["1994-08-01",174.86,{"v":0.077,"d":"7.70%"},291.43,{"v":0.0877,"d":"8.77%"},582.86,{"v":0.0977,"d":"9.77%"},582.86,{"v":0.0977,"d":"9.77%"},582.86,{"v":0.0977,"d":"9.77%"},{"v":56.945422,"d":"56.95"}]
["1994-09-01",174.86,{"v":0.077,"d":"7.70%"},291.43,{"v":0.0877,"d":"8.77%"},582.86,{"v":0.0977,"d":"9.77%"},582.86,{"v":0.0977,"d":"9.77%"},582.86,{"v":0.0977,"d":"9.77%"},{"v":56.945422,"d":"56.95"}]
["1994-10-01",174.86,{"v":0.077,"d":"7.70%"},291.43,{"v":0.0877,"d":"8.77%"},582.86,{"v":0.0977,"d":"9.77%"},582.86,{"v":0.0977,"d":"9.77%"},582.86,{"v":0.0977,"d":"9.77%"},{"v":56.945422,"d":"56.95"}]
["1994-11-01",174.86,{"v":0.077,"d":"7.70%"},291.43,{"v":0.0877,"d":"8.77%"},582.86,{"v":0.0977,"d":"9.77%"},582.86,{"v":0.0977,"d":"9.77%"},582.86,{"v":0.0977,"d":"9.77%"},{"v":56.945422,"d":"56.95"}]
["1994-12-01",174.86,{"v":0.077,"d":"7.70%"},291.43,{"v":0.0877,"d":"8.77%"},582.86,{"v":0.0977,"d":"9.77%"},582.86,{"v":0.0977,"d":"9.77%"},582.86,{"v":0.0977,"d":"9.77%"},{"v":56.945422,"d":"56.95"}]
["1995-01-01",174.86,{"v":0.077,"d":"7.70%"},291.43,{"v":0.0877,"d":"8.77%"},582.86,{"v":0.0977,"d":"9.77%"},582.86,{"v":0.0977,"d":"9.77%"},582.86,{"v":0.0977,"d":"9.77%"},{"v":56.945422,"d":"56.95"}]
["1995-02-01",174.86,{"v":0.077,"d":"7.70%"},291.43,{"v":0.0877,"d":"8.77%"},582.86,{"v":0.0977,"d":"9.77%"},582.86,{"v":0.0977,"d":"9.77%"},582.86,{"v":0.0977,"d":"9.77%"},{"v":56.945422,"d":"56.95"}]
["1995-03-01",174.86,{"v":0.077,"d":"7.70%"},291.43,{"v":0.0877,"d":"8.77%"},582.86,{"v":0.0977,"d":"9.77%"},582.86,{"v":0.0977,"d":"9.77%"},582.86,{"v":0.0977,"d":"9.77%"},{"v":56.945422,"d":"56.95"}]
["1995-04-01",174.86,{"v":0.077,"d":"7.70%"},291.43,{"v":0.0877,"d":"8.77%"},582.86,{"v":0.0977,"d":"9.77%"},582.86,{"v":0.0977,"d":"9.77%"},582.86,{"v":0.0977,"d":"9.77%"},{"v":56.945422,"d":"56.95"}]
["1995-05-01",{"v":249.8,"d":"249.80"},{"v":0.077,"d":"7.70%"},416.33,{"v":0.0877,"d":"8.77%"},832.66,{"v":0.0977,"d":"9.77%"},832.66,{"v":0.0977,"d":"9.77%"},832.66,{"v":0.0977,"d":"9.77%"},{"v":81.350882,"d":"81.35"}]
["1995-06-01",{"v":249.8,"d":"249.80"},{"v":0.077,"d":"7.70%"},416.33,{"v":0.0877,"d":"8.77%"},832.66,{"v":0.0977,"d":"9.77%"},832.66,{"v":0.0977,"d":"9.77%"},832.66,{"v":0.0977,"d":"9.77%"},{"v":81.350882,"d":"81.35"}]
["1995-07-01",{"v":249.8,"d":"249.80"},{"v":0.077,"d":"7.70%"},416.33,{"v":0.0877,"d":"8.77%"},832.66,{"v":0.0977,"d":"9.77%"},832.66,{"v":0.0977,"d":"9.77%"},832.66,{"v":0.0977,"d":"9.77%"},{"v":81.350882,"d":"81.35"}]
["1995-08-01",{"v":249.8,"d":"249.80"},{"v":0.077,"d":"7.70%"},416.33,{"v":0.0877,"d":"8.77%"},832.66,{"v":0.0977,"d":"9.77%"},832.66,{"v":0.0977,"d":"9.77%"},832.66,{"v":0.0977,"d":"9.77%"},{"v":81.350882,"d":"81.35"}]
["1995-09-01",{"v":249.8,"d":"249.80"},{"v":0.077,"d":"7.70%"},416.33,{"v":0.0877,"d":"8.77%"},832.66,{"v":0.0977,"d":"9.77%"},832.66,{"v":0.0977,"d":"9.77%"},832.66,{"v":0.0977,"d":"9.77%"},{"v":81.350882,"d":"81.35"}]
["1995-10-01",{"v":249.8,"d":"249.80"},{"v":0.077,"d":"7.70%"},416.33,{"v":0.0877,"d":"8.77%"},832.66,{"v":0.0977,"d":"9.77%"},832.66,{"v":0.0977,"d":"9.77%"},832.66,{"v":0.0977,"d":"9.77%"},{"v":81.350882,"d":"81.35"}]
["1995-11-01",{"v":249.8,"d":"249.80"},{"v":0.077,"d":"7.70%"},416.33,{"v":0.0877,"d":"8.77%"},832.66,{"v":0.0977,"d":"9.77%"},832.66,{"v":0.0977,"d":"9.77%"},832.66,{"v":0.0977,"d":"9.77%"},{"v":81.350882,"d":"81.35"}]
["1995-12-01",{"v":249.8,"d":"249.80"},{"v":0.077,"d":"7.70%"},416.33,{"v":0.0877,"d":"8.77%"},832.66,{"v":0.0977,"d":"9.77%"},832.66,{"v":0.0977,"d":"9.77%"},832.66,{"v":0.0977,"d":"9.77%"},{"v":81.350882,"d":"81.35"}]
["1996-01-01",{"v":249.8,"d":"249.80"},{"v":0.077,"d":"7.70%"},416.33,{"v":0.0877,"d":"8.77%"},832.66,{"v":0.0977,"d":"9.77%"},832.66,{"v":0.0977,"d":"9.77%"},832.66,{"v":0.0977,"d":"9.77%"},{"v":81.350882,"d":"81.35"}]
["1996-02-01",{"v":249.8,"d":"249.80"},{"v":0.077,"d":"7.70%"},416.33,{"v":0.0877,"d":"8.77%"},832.66,{"v":0.0977,"d":"9.77%"},832.66,{"v":0.0977,"d":"9.77%"},832.66,{"v":0.0977,"d":"9.77%"},{"v":81.350882,"d":"81.35"}]
["1996-03-01",{"v":249.8,"d":"249.80"},{"v":0.077,"d":"7.70%"},416.33,{"v":0.0877,"d":"8.77%"},832.66,{"v":0.0977,"d":"9.77%"},832.66,{"v":0.0977,"d":"9.77%"},832.66,{"v":0.0977,"d":"9.77%"},{"v":81.350882,"d":"81.35"}]
["1996-04-01",{"v":249.8,"d":"249.80"},{"v":0.077,"d":"7.70%"},416.33,{"v":0.0877,"d":"8.77%"},832.66,{"v":0.0977,"d":"9.77%"},832.66,{"v":0.0977,"d":"9.77%"},832.66,{"v":0.0977,"d":"9.77%"},{"v":81.350882,"d":"81.35"}]
["1996-05-01",287.27,{"v":0.077,"d":"7.70%"},478.78,{"v":0.0877,"d":"8.77%"},957.56,{"v":0.0977,"d":"9.77%"},957.56,{"v":0.0977,"d":"9.77%"},957.56,{"v":0.0977,"d":"9.77%"},{"v":93.55361199999999,"d":"93.55"}]
["1996-06-01",287.27,{"v":0.077,"d":"7.70%"},478.78,{"v":0.0877,"d":"8.77%"},957.56,{"v":0.0977,"d":"9.77%"},957.56,{"v":0.0977,"d":"9.77%"},957.56,{"v":0.0977,"d":"9.77%"},{"v":93.55361199999999,"d":"93.55"}]
["1996-07-01",287.27,{"v":0.077,"d":"7.70%"},478.78,{"v":0.0877,"d":"8.77%"},957.56,{"v":0.0977,"d":"9.77%"},957.56,{"v":0.0977,"d":"9.77%"},957.56,{"v":0.0977,"d":"9.77%"},{"v":93.55361199999999,"d":"93.55"}]
["1996-08-01",287.27,{"v":0.077,"d":"7.70%"},478.78,{"v":0.0877,"d":"8.77%"},957.56,{"v":0.0977,"d":"9.77%"},957.56,{"v":0.0977,"d":"9.77%"},957.56,{"v":0.0977,"d":"9.77%"},{"v":93.55361199999999,"d":"93.55"}]
["1996-09-01",287.27,{"v":0.077,"d":"7.70%"},478.78,{"v":0.0877,"d":"8.77%"},957.56,{"v":0.0977,"d":"9.77%"},957.56,{"v":0.0977,"d":"9.77%"},957.56,{"v":0.0977,"d":"9.77%"},{"v":93.55361199999999,"d":"93.55"}]
["1996-10-01",287.27,{"v":0.077,"d":"7.70%"},478.78,{"v":0.0877,"d":"8.77%"},957.56,{"v":0.0977,"d":"9.77%"},957.56,{"v":0.0977,"d":"9.77%"},957.56,{"v":0.0977,"d":"9.77%"},{"v":93.55361199999999,"d":"93.55"}]
["1996-11-01",287.27,{"v":0.077,"d":"7.70%"},478.78,{"v":0.0877,"d":"8.77%"},957.56,{"v":0.0977,"d":"9.77%"},957.56,{"v":0.0977,"d":"9.77%"},957.56,{"v":0.0977,"d":"9.77%"},{"v":93.55361199999999,"d":"93.55"}]
["1996-12-01",287.27,{"v":0.077,"d":"7.70%"},478.78,{"v":0.0877,"d":"8.77%"},957.56,{"v":0.0977,"d":"9.77%"},957.56,{"v":0.0977,"d":"9.77%"},957.56,{"v":0.0977,"d":"9.77%"},{"v":93.55361199999999,"d":"93.55"}]
["1997-01-01",309.56,{"v":0.0782,"d":"7.82%"},{"v":360,"d":"360.00"},{"v":0.0882,"d":"8.82%"},513.93,{"v":0.09,"d":"9.00%"},{"v":1031.87,"d":"1,031.87"},{"v":0.11,"d":"11.00%"},{"v":1031.87,"d":"1,031.87"},{"v":0.11,"d":"11.00%"},{"v":113.50569999999999,"d":"113.51"}]
["1997-02-01",309.56,{"v":0.0782,"d":"7.82%"},{"v":360,"d":"360.00"},{"v":0.0882,"d":"8.82%"},513.93,{"v":0.09,"d":"9.00%"},{"v":1031.87,"d":"1,031.87"},{"v":0.11,"d":"11.00%"},{"v":1031.87,"d":"1,031.87"},{"v":0.11,"d":"11.00%"},{"v":113.50569999999999,"d":"113.51"}]
["1997-03-01",309.56,{"v":0.0782,"d":"7.82%"},{"v":360,"d":"360.00"},{"v":0.0882,"d":"8.82%"},513.93,{"v":0.09,"d":"9.00%"},{"v":1031.87,"d":"1,031.87"},{"v":0.11,"d":"11.00%"},{"v":1031.87,"d":"1,031.87"},{"v":0.11,"d":"11.00%"},{"v":113.50569999999999,"d":"113.51"}]
["1997-04-01",309.56,{"v":0.0782,"d":"7.82%"},{"v":360,"d":"360.00"},{"v":0.0882,"d":"8.82%"},513.93,{"v":0.09,"d":"9.00%"},{"v":1031.87,"d":"1,031.87"},{"v":0.11,"d":"11.00%"},{"v":1031.87,"d":"1,031.87"},{"v":0.11,"d":"11.00%"},{"v":113.50569999999999,"d":"113.51"}]
["1997-05-01",309.56,{"v":0.0782,"d":"7.82%"},{"v":360,"d":"360.00"},{"v":0.0882,"d":"8.82%"},513.93,{"v":0.09,"d":"9.00%"},{"v":1031.87,"d":"1,031.87"},{"v":0.11,"d":"11.00%"},{"v":1031.87,"d":"1,031.87"},{"v":0.11,"d":"11.00%"},{"v":113.50569999999999,"d":"113.51"}]
["1997-06-01",309.56,{"v":0.0782,"d":"7.82%"},{"v":360,"d":"360.00"},{"v":0.0882,"d":"8.82%"},513.93,{"v":0.09,"d":"9.00%"},{"v":1031.87,"d":"1,031.87"},{"v":0.11,"d":"11.00%"},{"v":1031.87,"d":"1,031.87"},{"v":0.11,"d":"11.00%"},{"v":113.50569999999999,"d":"113.51"}]
["1997-07-01",309.56,{"v":0.0782,"d":"7.82%"},{"v":360,"d":"360.00"},{"v":0.0882,"d":"8.82%"},513.93,{"v":0.09,"d":"9.00%"},{"v":1031.87,"d":"1,031.87"},{"v":0.11,"d":"11.00%"},{"v":1031.87,"d":"1,031.87"},{"v":0.11,"d":"11.00%"},{"v":113.50569999999999,"d":"113.51"}]
["1997-08-01",309.56,{"v":0.0782,"d":"7.82%"},{"v":360,"d":"360.00"},{"v":0.0882,"d":"8.82%"},513.93,{"v":0.09,"d":"9.00%"},{"v":1031.87,"d":"1,031.87"},{"v":0.11,"d":"11.00%"},{"v":1031.87,"d":"1,031.87"},{"v":0.11,"d":"11.00%"},{"v":113.50569999999999,"d":"113.51"}]
["1997-09-01",309.56,{"v":0.0782,"d":"7.82%"},{"v":360,"d":"360.00"},{"v":0.0882,"d":"8.82%"},513.93,{"v":0.09,"d":"9.00%"},{"v":1031.87,"d":"1,031.87"},{"v":0.11,"d":"11.00%"},{"v":1031.87,"d":"1,031.87"},{"v":0.11,"d":"11.00%"},{"v":113.50569999999999,"d":"113.51"}]
["1997-10-01",309.56,{"v":0.0782,"d":"7.82%"},{"v":360,"d":"360.00"},{"v":0.0882,"d":"8.82%"},513.93,{"v":0.09,"d":"9.00%"},{"v":1031.87,"d":"1,031.87"},{"v":0.11,"d":"11.00%"},{"v":1031.87,"d":"1,031.87"},{"v":0.11,"d":"11.00%"},{"v":113.50569999999999,"d":"113.51"}]
["1997-11-01",309.56,{"v":0.0782,"d":"7.82%"},{"v":360,"d":"360.00"},{"v":0.0882,"d":"8.82%"},513.93,{"v":0.09,"d":"9.00%"},{"v":1031.87,"d":"1,031.87"},{"v":0.11,"d":"11.00%"},{"v":1031.87,"d":"1,031.87"},{"v":0.11,"d":"11.00%"},{"v":113.50569999999999,"d":"113.51"}]
["1997-12-01",309.56,{"v":0.0782,"d":"7.82%"},{"v":360,"d":"360.00"},{"v":0.0882,"d":"8.82%"},513.93,{"v":0.09,"d":"9.00%"},{"v":1031.87,"d":"1,031.87"},{"v":0.11,"d":"11.00%"},{"v":1031.87,"d":"1,031.87"},{"v":0.11,"d":"11.00%"},{"v":113.50569999999999,"d":"113.51"}]
["1998-01-01",309.56,{"v":0.0782,"d":"7.82%"},{"v":360,"d":"360.00"},{"v":0.0882,"d":"8.82%"},513.93,{"v":0.09,"d":"9.00%"},{"v":1031.87,"d":"1,031.87"},{"v":0.11,"d":"11.00%"},{"v":1031.87,"d":"1,031.87"},{"v":0.11,"d":"11.00%"},{"v":113.50569999999999,"d":"113.51"}]
["1998-02-01",309.56,{"v":0.0782,"d":"7.82%"},{"v":360,"d":"360.00"},{"v":0.0882,"d":"8.82%"},513.93,{"v":0.09,"d":"9.00%"},{"v":1031.87,"d":"1,031.87"},{"v":0.11,"d":"11.00%"},{"v":1031.87,"d":"1,031.87"},{"v":0.11,"d":"11.00%"},{"v":113.50569999999999,"d":"113.51"}]
["1998-03-01",309.56,{"v":0.0782,"d":"7.82%"},{"v":360,"d":"360.00"},{"v":0.0882,"d":"8.82%"},513.93,{"v":0.09,"d":"9.00%"},{"v":1031.87,"d":"1,031.87"},{"v":0.11,"d":"11.00%"},{"v":1031.87,"d":"1,031.87"},{"v":0.11,"d":"11.00%"},{"v":113.50569999999999,"d":"113.51"}]
["1998-04-01",309.56,{"v":0.0782,"d":"7.82%"},{"v":360,"d":"360.00"},{"v":0.0882,"d":"8.82%"},513.93,{"v":0.09,"d":"9.00%"},{"v":1031.87,"d":"1,031.87"},{"v":0.11,"d":"11.00%"},{"v":1031.87,"d":"1,031.87"},{"v":0.11,"d":"11.00%"},{"v":113.50569999999999,"d":"113.51"}]
["1998-05-01",309.56,{"v":0.0782,"d":"7.82%"},{"v":360,"d":"360.00"},{"v":0.0882,"d":"8.82%"},513.93,{"v":0.09,"d":"9.00%"},{"v":1031.87,"d":"1,031.87"},{"v":0.11,"d":"11.00%"},{"v":1031.87,"d":"1,031.87"},{"v":0.11,"d":"11.00%"},{"v":113.50569999999999,"d":"113.51"}]
["1998-06-01",324.45,{"v":0.0782,"d":"7.82%"},{"v":390,"d":"390.00"},{"v":0.0882,"d":"8.82%"},540.75,{"v":0.09,"d":"9.00%"},{"v":1081.5,"d":"1,081.50"},{"v":0.11,"d":"11.00%"},{"v":1081.5,"d":"1,081.50"},{"v":0.11,"d":"11.00%"},{"v":118.965,"d":"118.97"}]
["1998-07-01",324.45,{"v":0.0782,"d":"7.82%"},{"v":390,"d":"390.00"},{"v":0.0882,"d":"8.82%"},540.75,{"v":0.09,"d":"9.00%"},{"v":1081.5,"d":"1,081.50"},{"v":0.11,"d":"11.00%"},{"v":1081.5,"d":"1,081.50"},{"v":0.11,"d":"11.00%"},{"v":118.965,"d":"118.97"}]
["1998-08-01",324.45,{"v":0.0782,"d":"7.82%"},{"v":390,"d":"390.00"},{"v":0.0882,"d":"8.82%"},540.75,{"v":0.09,"d":"9.00%"},{"v":1081.5,"d":"1,081.50"},{"v":0.11,"d":"11.00%"},{"v":1081.5,"d":"1,081.50"},{"v":0.11,"d":"11.00%"},{"v":118.965,"d":"118.97"}]
["1998-09-01",324.45,{"v":0.0782,"d":"7.82%"},{"v":390,"d":"390.00"},{"v":0.0882,"d":"8.82%"},540.75,{"v":0.09,"d":"9.00%"},{"v":1081.5,"d":"1,081.50"},{"v":0.11,"d":"11.00%"},{"v":1081.5,"d":"1,081.50"},{"v":0.11,"d":"11.00%"},{"v":118.965,"d":"118.97"}]
["1998-10-01",324.45,{"v":0.0782,"d":"7.82%"},{"v":390,"d":"390.00"},{"v":0.0882,"d":"8.82%"},540.75,{"v":0.09,"d":"9.00%"},{"v":1081.5,"d":"1,081.50"},{"v":0.11,"d":"11.00%"},{"v":1081.5,"d":"1,081.50"},{"v":0.11,"d":"11.00%"},{"v":118.965,"d":"118.97"}]
["1998-11-01",324.45,{"v":0.0782,"d":"7.82%"},{"v":390,"d":"390.00"},{"v":0.0882,"d":"8.82%"},540.75,{"v":0.09,"d":"9.00%"},{"v":1081.5,"d":"1,081.50"},{"v":0.11,"d":"11.00%"},{"v":1081.5,"d":"1,081.50"},{"v":0.11,"d":"11.00%"},{"v":118.965,"d":"118.97"}]
["1998-12-01",{"v":360,"d":"360.00"},{"v":0.0782,"d":"7.82%"},{"v":390,"d":"390.00"},{"v":0.0882,"d":"8.82%"},{"v":600,"d":"600.00"},{"v":0.09,"d":"9.00%"},{"v":1200,"d":"1,200.00"},{"v":0.11,"d":"11.00%"},{"v":1200,"d":"1,200.00"},{"v":0.11,"d":"11.00%"},{"v":132,"d":"132.00"}]
["1999-01-01",{"v":360,"d":"360.00"},{"v":0.08,"d":"8.00%"},{"v":600,"d":"600.00"},{"v":0.09,"d":"9.00%"},{"v":1200,"d":"1,200.00"},{"v":0.11,"d":"11.00%"},{"v":1200,"d":"1,200.00"},{"v":0.11,"d":"11.00%"},{"v":1200,"d":"1,200.00"},{"v":0.11,"d":"11.00%"},{"v":132,"d":"132.00"}]
["1999-02-01",{"v":360,"d":"360.00"},{"v":0.08,"d":"8.00%"},{"v":600,"d":"600.00"},{"v":0.09,"d":"9.00%"},{"v":1200,"d":"1,200.00"},{"v":0.11,"d":"11.00%"},{"v":1200,"d":"1,200.00"},{"v":0.11,"d":"11.00%"},{"v":1200,"d":"1,200.00"},{"v":0.11,"d":"11.00%"},{"v":132,"d":"132.00"}]
["1999-03-01",{"v":360,"d":"360.00"},{"v":0.08,"d":"8.00%"},{"v":600,"d":"600.00"},{"v":0.09,"d":"9.00%"},{"v":1200,"d":"1,200.00"},{"v":0.11,"d":"11.00%"},{"v":1200,"d":"1,200.00"},{"v":0.11,"d":"11.00%"},{"v":1200,"d":"1,200.00"},{"v":0.11,"d":"11.00%"},{"v":132,"d":"132.00"}]
["1999-04-01",{"v":360,"d":"360.00"},{"v":0.08,"d":"8.00%"},{"v":600,"d":"600.00"},{"v":0.09,"d":"9.00%"},{"v":1200,"d":"1,200.00"},{"v":0.11,"d":"11.00%"},{"v":1200,"d":"1,200.00"},{"v":0.11,"d":"11.00%"},{"v":1200,"d":"1,200.00"},{"v":0.11,"d":"11.00%"},{"v":132,"d":"132.00"}]
["1999-05-01",{"v":360,"d":"360.00"},{"v":0.08,"d":"8.00%"},{"v":600,"d":"600.00"},{"v":0.09,"d":"9.00%"},{"v":1200,"d":"1,200.00"},{"v":0.11,"d":"11.00%"},{"v":1200,"d":"1,200.00"},{"v":0.11,"d":"11.00%"},{"v":1200,"d":"1,200.00"},{"v":0.11,"d":"11.00%"},{"v":132,"d":"132.00"}]
["1999-06-01",{"v":376.6,"d":"376.60"},{"v":0.0765,"d":"7.65%"},{"v":408,"d":"408.00"},{"v":0.0865,"d":"8.65%"},627.66,{"v":0.09,"d":"9.00%"},{"v":1255.32,"d":"1,255.32"},{"v":0.11,"d":"11.00%"},{"v":1255.32,"d":"1,255.32"},{"v":0.11,"d":"11.00%"},{"v":138.0852,"d":"138.09"}]
["1999-07-01",{"v":376.6,"d":"376.60"},{"v":0.0765,"d":"7.65%"},{"v":408,"d":"408.00"},{"v":0.0865,"d":"8.65%"},627.66,{"v":0.09,"d":"9.00%"},{"v":1255.32,"d":"1,255.32"},{"v":0.11,"d":"11.00%"},{"v":1255.32,"d":"1,255.32"},{"v":0.11,"d":"11.00%"},{"v":138.0852,"d":"138.09"}]
["1999-08-01",{"v":376.6,"d":"376.60"},{"v":0.0765,"d":"7.65%"},{"v":408,"d":"408.00"},{"v":0.0865,"d":"8.65%"},627.66,{"v":0.09,"d":"9.00%"},{"v":1255.32,"d":"1,255.32"},{"v":0.11,"d":"11.00%"},{"v":1255.32,"d":"1,255.32"},{"v":0.11,"d":"11.00%"},{"v":138.0852,"d":"138.09"}]
["1999-09-01",{"v":376.6,"d":"376.60"},{"v":0.0765,"d":"7.65%"},{"v":408,"d":"408.00"},{"v":0.0865,"d":"8.65%"},627.66,{"v":0.09,"d":"9.00%"},{"v":1255.32,"d":"1,255.32"},{"v":0.11,"d":"11.00%"},{"v":1255.32,"d":"1,255.32"},{"v":0.11,"d":"11.00%"},{"v":138.0852,"d":"138.09"}]
["1999-10-01",{"v":376.6,"d":"376.60"},{"v":0.0765,"d":"7.65%"},{"v":408,"d":"408.00"},{"v":0.0865,"d":"8.65%"},627.66,{"v":0.09,"d":"9.00%"},{"v":1255.32,"d":"1,255.32"},{"v":0.11,"d":"11.00%"},{"v":1255.32,"d":"1,255.32"},{"v":0.11,"d":"11.00%"},{"v":138.0852,"d":"138.09"}]
["1999-11-01",{"v":376.6,"d":"376.60"},{"v":0.0765,"d":"7.65%"},{"v":408,"d":"408.00"},{"v":0.0865,"d":"8.65%"},627.66,{"v":0.09,"d":"9.00%"},{"v":1255.32,"d":"1,255.32"},{"v":0.11,"d":"11.00%"},{"v":1255.32,"d":"1,255.32"},{"v":0.11,"d":"11.00%"},{"v":138.0852,"d":"138.09"}]
["1999-12-01",{"v":376.6,"d":"376.60"},{"v":0.0765,"d":"7.65%"},{"v":408,"d":"408.00"},{"v":0.0865,"d":"8.65%"},627.66,{"v":0.09,"d":"9.00%"},{"v":1255.32,"d":"1,255.32"},{"v":0.11,"d":"11.00%"},{"v":1255.32,"d":"1,255.32"},{"v":0.11,"d":"11.00%"},{"v":138.0852,"d":"138.09"}]
["2000-01-01",{"v":376.6,"d":"376.60"},{"v":0.0765,"d":"7.65%"},{"v":408,"d":"408.00"},{"v":0.0865,"d":"8.65%"},627.66,{"v":0.09,"d":"9.00%"},{"v":1255.32,"d":"1,255.32"},{"v":0.11,"d":"11.00%"},{"v":1255.32,"d":"1,255.32"},{"v":0.11,"d":"11.00%"},{"v":138.0852,"d":"138.09"}]
["2000-02-01",{"v":376.6,"d":"376.60"},{"v":0.0765,"d":"7.65%"},{"v":408,"d":"408.00"},{"v":0.0865,"d":"8.65%"},627.66,{"v":0.09,"d":"9.00%"},{"v":1255.32,"d":"1,255.32"},{"v":0.11,"d":"11.00%"},{"v":1255.32,"d":"1,255.32"},{"v":0.11,"d":"11.00%"},{"v":138.0852,"d":"138.09"}]
["2000-03-01",{"v":376.6,"d":"376.60"},{"v":0.0765,"d":"7.65%"},{"v":408,"d":"408.00"},{"v":0.0865,"d":"8.65%"},627.66,{"v":0.09,"d":"9.00%"},{"v":1255.32,"d":"1,255.32"},{"v":0.11,"d":"11.00%"},{"v":1255.32,"d":"1,255.32"},{"v":0.11,"d":"11.00%"},{"v":138.0852,"d":"138.09"}]
["2000-04-01",{"v":376.6,"d":"376.60"},{"v":0.0765,"d":"7.65%"},{"v":450,"d":"450.00"},{"v":0.0865,"d":"8.65%"},627.66,{"v":0.09,"d":"9.00%"},{"v":1255.32,"d":"1,255.32"},{"v":0.11,"d":"11.00%"},{"v":1255.32,"d":"1,255.32"},{"v":0.11,"d":"11.00%"},{"v":138.0852,"d":"138.09"}]
["2000-05-01",{"v":376.6,"d":"376.60"},{"v":0.0765,"d":"7.65%"},{"v":453,"d":"453.00"},{"v":0.0865,"d":"8.65%"},627.66,{"v":0.09,"d":"9.00%"},{"v":1255.32,"d":"1,255.32"},{"v":0.11,"d":"11.00%"},{"v":1255.32,"d":"1,255.32"},{"v":0.11,"d":"11.00%"},{"v":138.0852,"d":"138.09"}]
["2000-06-01",398.48,{"v":0.0765,"d":"7.65%"},{"v":453,"d":"453.00"},{"v":0.0865,"d":"8.65%"},664.13,{"v":0.09,"d":"9.00%"},{"v":1328.25,"d":"1,328.25"},{"v":0.11,"d":"11.00%"},{"v":1328.25,"d":"1,328.25"},{"v":0.11,"d":"11.00%"},{"v":146.1075,"d":"146.11"}]
["2000-07-01",398.48,{"v":0.0765,"d":"7.65%"},{"v":453,"d":"453.00"},{"v":0.0865,"d":"8.65%"},664.13,{"v":0.09,"d":"9.00%"},{"v":1328.25,"d":"1,328.25"},{"v":0.11,"d":"11.00%"},{"v":1328.25,"d":"1,328.25"},{"v":0.11,"d":"11.00%"},{"v":146.1075,"d":"146.11"}]
["2000-08-01",398.48,{"v":0.0765,"d":"7.65%"},{"v":453,"d":"453.00"},{"v":0.0865,"d":"8.65%"},664.13,{"v":0.09,"d":"9.00%"},{"v":1328.25,"d":"1,328.25"},{"v":0.11,"d":"11.00%"},{"v":1328.25,"d":"1,328.25"},{"v":0.11,"d":"11.00%"},{"v":146.1075,"d":"146.11"}]
["2000-09-01",398.48,{"v":0.0765,"d":"7.65%"},{"v":453,"d":"453.00"},{"v":0.0865,"d":"8.65%"},664.13,{"v":0.09,"d":"9.00%"},{"v":1328.25,"d":"1,328.25"},{"v":0.11,"d":"11.00%"},{"v":1328.25,"d":"1,328.25"},{"v":0.11,"d":"11.00%"},{"v":146.1075,"d":"146.11"}]
["2000-10-01",398.48,{"v":0.0765,"d":"7.65%"},{"v":453,"d":"453.00"},{"v":0.0865,"d":"8.65%"},664.13,{"v":0.09,"d":"9.00%"},{"v":1328.25,"d":"1,328.25"},{"v":0.11,"d":"11.00%"},{"v":1328.25,"d":"1,328.25"},{"v":0.11,"d":"11.00%"},{"v":146.1075,"d":"146.11"}]
["2000-11-01",398.48,{"v":0.0765,"d":"7.65%"},{"v":453,"d":"453.00"},{"v":0.0865,"d":"8.65%"},664.13,{"v":0.09,"d":"9.00%"},{"v":1328.25,"d":"1,328.25"},{"v":0.11,"d":"11.00%"},{"v":1328.25,"d":"1,328.25"},{"v":0.11,"d":"11.00%"},{"v":146.1075,"d":"146.11"}]
["2000-12-01",398.48,{"v":0.0765,"d":"7.65%"},{"v":453,"d":"453.00"},{"v":0.0865,"d":"8.65%"},664.13,{"v":0.09,"d":"9.00%"},{"v":1328.25,"d":"1,328.25"},{"v":0.11,"d":"11.00%"},{"v":1328.25,"d":"1,328.25"},{"v":0.11,"d":"11.00%"},{"v":146.1075,"d":"146.11"}]
["2001-01-01",398.48,{"v":0.0765,"d":"7.65%"},{"v":453,"d":"453.00"},{"v":0.0865,"d":"8.65%"},664.13,{"v":0.09,"d":"9.00%"},{"v":1328.25,"d":"1,328.25"},{"v":0.11,"d":"11.00%"},{"v":1328.25,"d":"1,328.25"},{"v":0.11,"d":"11.00%"},{"v":146.1075,"d":"146.11"}]
["2001-02-01",398.48,{"v":0.0765,"d":"7.65%"},{"v":453,"d":"453.00"},{"v":0.0865,"d":"8.65%"},664.13,{"v":0.09,"d":"9.00%"},{"v":1328.25,"d":"1,328.25"},{"v":0.11,"d":"11.00%"},{"v":1328.25,"d":"1,328.25"},{"v":0.11,"d":"11.00%"},{"v":146.1075,"d":"146.11"}]
["2001-03-01",398.48,{"v":0.0765,"d":"7.65%"},{"v":453,"d":"453.00"},{"v":0.0865,"d":"8.65%"},664.13,{"v":0.09,"d":"9.00%"},{"v":1328.25,"d":"1,328.25"},{"v":0.11,"d":"11.00%"},{"v":1328.25,"d":"1,328.25"},{"v":0.11,"d":"11.00%"},{"v":146.1075,"d":"146.11"}]
["2001-04-01",398.48,{"v":0.0765,"d":"7.65%"},{"v":540,"d":"540.00"},{"v":0.0865,"d":"8.65%"},664.13,{"v":0.09,"d":"9.00%"},{"v":1328.25,"d":"1,328.25"},{"v":0.11,"d":"11.00%"},{"v":1328.25,"d":"1,328.25"},{"v":0.11,"d":"11.00%"},{"v":146.1075,"d":"146.11"}]
["2001-05-01",398.48,{"v":0.0765,"d":"7.65%"},{"v":540,"d":"540.00"},{"v":0.0865,"d":"8.65%"},664.13,{"v":0.09,"d":"9.00%"},{"v":1328.25,"d":"1,328.25"},{"v":0.11,"d":"11.00%"},{"v":1328.25,"d":"1,328.25"},{"v":0.11,"d":"11.00%"},{"v":146.1075,"d":"146.11"}]
["2001-06-01",{"v":429,"d":"429.00"},{"v":0.0765,"d":"7.65%"},{"v":540,"d":"540.00"},{"v":0.0865,"d":"8.65%"},{"v":715,"d":"715.00"},{"v":0.09,"d":"9.00%"},{"v":1430,"d":"1,430.00"},{"v":0.11,"d":"11.00%"},{"v":1430,"d":"1,430.00"},{"v":0.11,"d":"11.00%"},{"v":157.3,"d":"157.30"}]
["2001-07-01",{"v":429,"d":"429.00"},{"v":0.0765,"d":"7.65%"},{"v":540,"d":"540.00"},{"v":0.0865,"d":"8.65%"},{"v":715,"d":"715.00"},{"v":0.09,"d":"9.00%"},{"v":1430,"d":"1,430.00"},{"v":0.11,"d":"11.00%"},{"v":1430,"d":"1,430.00"},{"v":0.11,"d":"11.00%"},{"v":157.3,"d":"157.30"}]
["2001-08-01",{"v":429,"d":"429.00"},{"v":0.0765,"d":"7.65%"},{"v":540,"d":"540.00"},{"v":0.0865,"d":"8.65%"},{"v":715,"d":"715.00"},{"v":0.09,"d":"9.00%"},{"v":1430,"d":"1,430.00"},{"v":0.11,"d":"11.00%"},{"v":1430,"d":"1,430.00"},{"v":0.11,"d":"11.00%"},{"v":157.3,"d":"157.30"}]
["2001-09-01",{"v":429,"d":"429.00"},{"v":0.0765,"d":"7.65%"},{"v":540,"d":"540.00"},{"v":0.0865,"d":"8.65%"},{"v":715,"d":"715.00"},{"v":0.09,"d":"9.00%"},{"v":1430,"d":"1,430.00"},{"v":0.11,"d":"11.00%"},{"v":1430,"d":"1,430.00"},{"v":0.11,"d":"11.00%"},{"v":157.3,"d":"157.30"}]
["2001-10-01",{"v":429,"d":"429.00"},{"v":0.0765,"d":"7.65%"},{"v":540,"d":"540.00"},{"v":0.0865,"d":"8.65%"},{"v":715,"d":"715.00"},{"v":0.09,"d":"9.00%"},{"v":1430,"d":"1,430.00"},{"v":0.11,"d":"11.00%"},{"v":1430,"d":"1,430.00"},{"v":0.11,"d":"11.00%"},{"v":157.3,"d":"157.30"}]
["2001-11-01",{"v":429,"d":"429.00"},{"v":0.0765,"d":"7.65%"},{"v":540,"d":"540.00"},{"v":0.0865,"d":"8.65%"},{"v":715,"d":"715.00"},{"v":0.09,"d":"9.00%"},{"v":1430,"d":"1,430.00"},{"v":0.11,"d":"11.00%"},{"v":1430,"d":"1,430.00"},{"v":0.11,"d":"11.00%"},{"v":157.3,"d":"157.30"}]
["2001-12-01",{"v":429,"d":"429.00"},{"v":0.0765,"d":"7.65%"},{"v":540,"d":"540.00"},{"v":0.0865,"d":"8.65%"},{"v":715,"d":"715.00"},{"v":0.09,"d":"9.00%"},{"v":1430,"d":"1,430.00"},{"v":0.11,"d":"11.00%"},{"v":1430,"d":"1,430.00"},{"v":0.11,"d":"11.00%"},{"v":157.3,"d":"157.30"}]
["2002-01-01",{"v":429,"d":"429.00"},{"v":0.0765,"d":"7.65%"},{"v":540,"d":"540.00"},{"v":0.0865,"d":"8.65%"},{"v":715,"d":"715.00"},{"v":0.09,"d":"9.00%"},{"v":1430,"d":"1,430.00"},{"v":0.11,"d":"11.00%"},{"v":1430,"d":"1,430.00"},{"v":0.11,"d":"11.00%"},{"v":157.3,"d":"157.30"}]
["2002-02-01",{"v":429,"d":"429.00"},{"v":0.0765,"d":"7.65%"},{"v":540,"d":"540.00"},{"v":0.0865,"d":"8.65%"},{"v":715,"d":"715.00"},{"v":0.09,"d":"9.00%"},{"v":1430,"d":"1,430.00"},{"v":0.11,"d":"11.00%"},{"v":1430,"d":"1,430.00"},{"v":0.11,"d":"11.00%"},{"v":157.3,"d":"157.30"}]
["2002-03-01",{"v":429,"d":"429.00"},{"v":0.0765,"d":"7.65%"},{"v":540,"d":"540.00"},{"v":0.0865,"d":"8.65%"},{"v":715,"d":"715.00"},{"v":0.09,"d":"9.00%"},{"v":1430,"d":"1,430.00"},{"v":0.11,"d":"11.00%"},{"v":1430,"d":"1,430.00"},{"v":0.11,"d":"11.00%"},{"v":157.3,"d":"157.30"}]
["2002-04-01",{"v":429,"d":"429.00"},{"v":0.0765,"d":"7.65%"},{"v":600,"d":"600.00"},{"v":0.0865,"d":"8.65%"},{"v":715,"d":"715.00"},{"v":0.09,"d":"9.00%"},{"v":1430,"d":"1,430.00"},{"v":0.11,"d":"11.00%"},{"v":1430,"d":"1,430.00"},{"v":0.11,"d":"11.00%"},{"v":157.3,"d":"157.30"}]
["2002-05-01",{"v":429,"d":"429.00"},{"v":0.0765,"d":"7.65%"},{"v":600,"d":"600.00"},{"v":0.0865,"d":"8.65%"},{"v":715,"d":"715.00"},{"v":0.09,"d":"9.00%"},{"v":1430,"d":"1,430.00"},{"v":0.11,"d":"11.00%"},{"v":1430,"d":"1,430.00"},{"v":0.11,"d":"11.00%"},{"v":157.3,"d":"157.30"}]
["2002-06-01",468.47,{"v":0.0765,"d":"7.65%"},{"v":600,"d":"600.00"},{"v":0.0865,"d":"8.65%"},780.78,{"v":0.09,"d":"9.00%"},{"v":1561.56,"d":"1,561.56"},{"v":0.11,"d":"11.00%"},{"v":1561.56,"d":"1,561.56"},{"v":0.11,"d":"11.00%"},{"v":171.7716,"d":"171.77"}]
["2002-07-01",468.47,{"v":0.0765,"d":"7.65%"},{"v":600,"d":"600.00"},{"v":0.0865,"d":"8.65%"},780.78,{"v":0.09,"d":"9.00%"},{"v":1561.56,"d":"1,561.56"},{"v":0.11,"d":"11.00%"},{"v":1561.56,"d":"1,561.56"},{"v":0.11,"d":"11.00%"},{"v":171.7716,"d":"171.77"}]
["2002-08-01",468.47,{"v":0.0765,"d":"7.65%"},{"v":600,"d":"600.00"},{"v":0.0865,"d":"8.65%"},780.78,{"v":0.09,"d":"9.00%"},{"v":1561.56,"d":"1,561.56"},{"v":0.11,"d":"11.00%"},{"v":1561.56,"d":"1,561.56"},{"v":0.11,"d":"11.00%"},{"v":171.7716,"d":"171.77"}]
["2002-09-01",468.47,{"v":0.0765,"d":"7.65%"},{"v":600,"d":"600.00"},{"v":0.0865,"d":"8.65%"},780.78,{"v":0.09,"d":"9.00%"},{"v":1561.56,"d":"1,561.56"},{"v":0.11,"d":"11.00%"},{"v":1561.56,"d":"1,561.56"},{"v":0.11,"d":"11.00%"},{"v":171.7716,"d":"171.77"}]
["2002-10-01",468.47,{"v":0.0765,"d":"7.65%"},{"v":600,"d":"600.00"},{"v":0.0865,"d":"8.65%"},780.78,{"v":0.09,"d":"9.00%"},{"v":1561.56,"d":"1,561.56"},{"v":0.11,"d":"11.00%"},{"v":1561.56,"d":"1,561.56"},{"v":0.11,"d":"11.00%"},{"v":171.7716,"d":"171.77"}]
["2002-11-01",468.47,{"v":0.0765,"d":"7.65%"},{"v":600,"d":"600.00"},{"v":0.0865,"d":"8.65%"},780.78,{"v":0.09,"d":"9.00%"},{"v":1561.56,"d":"1,561.56"},{"v":0.11,"d":"11.00%"},{"v":1561.56,"d":"1,561.56"},{"v":0.11,"d":"11.00%"},{"v":171.7716,"d":"171.77"}]
["2002-12-01",468.47,{"v":0.0765,"d":"7.65%"},{"v":600,"d":"600.00"},{"v":0.0865,"d":"8.65%"},780.78,{"v":0.09,"d":"9.00%"},{"v":1561.56,"d":"1,561.56"},{"v":0.11,"d":"11.00%"},{"v":1561.56,"d":"1,561.56"},{"v":0.11,"d":"11.00%"},{"v":171.7716,"d":"171.77"}]
["2003-01-01",468.47,{"v":0.0765,"d":"7.65%"},{"v":600,"d":"600.00"},{"v":0.0865,"d":"8.65%"},780.78,{"v":0.09,"d":"9.00%"},{"v":1561.56,"d":"1,561.56"},{"v":0.11,"d":"11.00%"},{"v":1561.56,"d":"1,561.56"},{"v":0.11,"d":"11.00%"},{"v":171.7716,"d":"171.77"}]
["2003-02-01",468.47,{"v":0.0765,"d":"7.65%"},{"v":600,"d":"600.00"},{"v":0.0865,"d":"8.65%"},780.78,{"v":0.09,"d":"9.00%"},{"v":1561.56,"d":"1,561.56"},{"v":0.11,"d":"11.00%"},{"v":1561.56,"d":"1,561.56"},{"v":0.11,"d":"11.00%"},{"v":171.7716,"d":"171.77"}]
["2003-03-01",468.47,{"v":0.0765,"d":"7.65%"},{"v":600,"d":"600.00"},{"v":0.0865,"d":"8.65%"},780.78,{"v":0.09,"d":"9.00%"},{"v":1561.56,"d":"1,561.56"},{"v":0.11,"d":"11.00%"},{"v":1561.56,"d":"1,561.56"},{"v":0.11,"d":"11.00%"},{"v":171.7716,"d":"171.77"}]
["2003-04-01",468.47,{"v":0.0765,"d":"7.65%"},{"v":600,"d":"600.00"},{"v":0.0865,"d":"8.65%"},780.78,{"v":0.09,"d":"9.00%"},{"v":1561.56,"d":"1,561.56"},{"v":0.11,"d":"11.00%"},{"v":1561.56,"d":"1,561.56"},{"v":0.11,"d":"11.00%"},{"v":171.7716,"d":"171.77"}]
["2003-05-01",468.47,{"v":0.0765,"d":"7.65%"},{"v":600,"d":"600.00"},{"v":0.0865,"d":"8.65%"},780.78,{"v":0.09,"d":"9.00%"},{"v":1561.56,"d":"1,561.56"},{"v":0.11,"d":"11.00%"},{"v":1561.56,"d":"1,561.56"},{"v":0.11,"d":"11.00%"},{"v":171.7716,"d":"171.77"}]
["2003-06-01",560.81,{"v":0.0765,"d":"7.65%"},{"v":720,"d":"720.00"},{"v":0.0865,"d":"8.65%"},934.67,{"v":0.09,"d":"9.00%"},{"v":1869.34,"d":"1,869.34"},{"v":0.11,"d":"11.00%"},{"v":1869.34,"d":"1,869.34"},{"v":0.11,"d":"11.00%"},{"v":205.6274,"d":"205.63"}]
["2003-07-01",560.81,{"v":0.0765,"d":"7.65%"},{"v":720,"d":"720.00"},{"v":0.0865,"d":"8.65%"},934.67,{"v":0.09,"d":"9.00%"},{"v":1869.34,"d":"1,869.34"},{"v":0.11,"d":"11.00%"},{"v":1869.34,"d":"1,869.34"},{"v":0.11,"d":"11.00%"},{"v":205.6274,"d":"205.63"}]
["2003-08-01",560.81,{"v":0.0765,"d":"7.65%"},{"v":720,"d":"720.00"},{"v":0.0865,"d":"8.65%"},934.67,{"v":0.09,"d":"9.00%"},{"v":1869.34,"d":"1,869.34"},{"v":0.11,"d":"11.00%"},{"v":1869.34,"d":"1,869.34"},{"v":0.11,"d":"11.00%"},{"v":205.6274,"d":"205.63"}]
["2003-09-01",560.81,{"v":0.0765,"d":"7.65%"},{"v":720,"d":"720.00"},{"v":0.0865,"d":"8.65%"},934.67,{"v":0.09,"d":"9.00%"},{"v":1869.34,"d":"1,869.34"},{"v":0.11,"d":"11.00%"},{"v":1869.34,"d":"1,869.34"},{"v":0.11,"d":"11.00%"},{"v":205.6274,"d":"205.63"}]
["2003-10-01",560.81,{"v":0.0765,"d":"7.65%"},{"v":720,"d":"720.00"},{"v":0.0865,"d":"8.65%"},934.67,{"v":0.09,"d":"9.00%"},{"v":1869.34,"d":"1,869.34"},{"v":0.11,"d":"11.00%"},{"v":1869.34,"d":"1,869.34"},{"v":0.11,"d":"11.00%"},{"v":205.6274,"d":"205.63"}]
["2003-11-01",560.81,{"v":0.0765,"d":"7.65%"},{"v":720,"d":"720.00"},{"v":0.0865,"d":"8.65%"},934.67,{"v":0.09,"d":"9.00%"},{"v":1869.34,"d":"1,869.34"},{"v":0.11,"d":"11.00%"},{"v":1869.34,"d":"1,869.34"},{"v":0.11,"d":"11.00%"},{"v":205.6274,"d":"205.63"}]
["2003-12-01",560.81,{"v":0.0765,"d":"7.65%"},{"v":720,"d":"720.00"},{"v":0.0865,"d":"8.65%"},934.67,{"v":0.09,"d":"9.00%"},{"v":1869.34,"d":"1,869.34"},{"v":0.11,"d":"11.00%"},{"v":1869.34,"d":"1,869.34"},{"v":0.11,"d":"11.00%"},{"v":205.6274,"d":"205.63"}]
["2004-01-01",{"v":720,"d":"720.00"},{"v":0.0765,"d":"7.65%"},{"v":1200,"d":"1,200.00"},{"v":0.09,"d":"9.00%"},{"v":2400,"d":"2,400.00"},{"v":0.11,"d":"11.00%"},{"v":2400,"d":"2,400.00"},{"v":0.11,"d":"11.00%"},{"v":2400,"d":"2,400.00"},{"v":0.11,"d":"11.00%"},{"v":264,"d":"264.00"}]
["2004-02-01",{"v":720,"d":"720.00"},{"v":0.0765,"d":"7.65%"},{"v":1200,"d":"1,200.00"},{"v":0.09,"d":"9.00%"},{"v":2400,"d":"2,400.00"},{"v":0.11,"d":"11.00%"},{"v":2400,"d":"2,400.00"},{"v":0.11,"d":"11.00%"},{"v":2400,"d":"2,400.00"},{"v":0.11,"d":"11.00%"},{"v":264,"d":"264.00"}]
["2004-03-01",{"v":720,"d":"720.00"},{"v":0.0765,"d":"7.65%"},{"v":1200,"d":"1,200.00"},{"v":0.09,"d":"9.00%"},{"v":2400,"d":"2,400.00"},{"v":0.11,"d":"11.00%"},{"v":2400,"d":"2,400.00"},{"v":0.11,"d":"11.00%"},{"v":2400,"d":"2,400.00"},{"v":0.11,"d":"11.00%"},{"v":264,"d":"264.00"}]
["2004-04-01",{"v":720,"d":"720.00"},{"v":0.0765,"d":"7.65%"},{"v":1200,"d":"1,200.00"},{"v":0.09,"d":"9.00%"},{"v":2400,"d":"2,400.00"},{"v":0.11,"d":"11.00%"},{"v":2400,"d":"2,400.00"},{"v":0.11,"d":"11.00%"},{"v":2400,"d":"2,400.00"},{"v":0.11,"d":"11.00%"},{"v":264,"d":"264.00"}]
["2004-05-01",752.62,{"v":0.0765,"d":"7.65%"},{"v":780,"d":"780.00"},{"v":0.0865,"d":"8.65%"},{"v":1254.36,"d":"1,254.36"},{"v":0.09,"d":"9.00%"},{"v":2508.72,"d":"2,508.72"},{"v":0.11,"d":"11.00%"},{"v":2508.72,"d":"2,508.72"},{"v":0.11,"d":"11.00%"},{"v":275.95919999999995,"d":"275.96"}]
["2004-06-01",752.62,{"v":0.0765,"d":"7.65%"},{"v":780,"d":"780.00"},{"v":0.0865,"d":"8.65%"},{"v":1254.36,"d":"1,254.36"},{"v":0.09,"d":"9.00%"},{"v":2508.72,"d":"2,508.72"},{"v":0.11,"d":"11.00%"},{"v":2508.72,"d":"2,508.72"},{"v":0.11,"d":"11.00%"},{"v":275.95919999999995,"d":"275.96"}]
["2004-07-01",752.62,{"v":0.0765,"d":"7.65%"},{"v":780,"d":"780.00"},{"v":0.0865,"d":"8.65%"},{"v":1254.36,"d":"1,254.36"},{"v":0.09,"d":"9.00%"},{"v":2508.72,"d":"2,508.72"},{"v":0.11,"d":"11.00%"},{"v":2508.72,"d":"2,508.72"},{"v":0.11,"d":"11.00%"},{"v":275.95919999999995,"d":"275.96"}]
["2004-08-01",752.62,{"v":0.0765,"d":"7.65%"},{"v":780,"d":"780.00"},{"v":0.0865,"d":"8.65%"},{"v":1254.36,"d":"1,254.36"},{"v":0.09,"d":"9.00%"},{"v":2508.72,"d":"2,508.72"},{"v":0.11,"d":"11.00%"},{"v":2508.72,"d":"2,508.72"},{"v":0.11,"d":"11.00%"},{"v":275.95919999999995,"d":"275.96"}]
["2004-09-01",752.62,{"v":0.0765,"d":"7.65%"},{"v":780,"d":"780.00"},{"v":0.0865,"d":"8.65%"},{"v":1254.36,"d":"1,254.36"},{"v":0.09,"d":"9.00%"},{"v":2508.72,"d":"2,508.72"},{"v":0.11,"d":"11.00%"},{"v":2508.72,"d":"2,508.72"},{"v":0.11,"d":"11.00%"},{"v":275.95919999999995,"d":"275.96"}]
["2004-10-01",752.62,{"v":0.0765,"d":"7.65%"},{"v":780,"d":"780.00"},{"v":0.0865,"d":"8.65%"},{"v":1254.36,"d":"1,254.36"},{"v":0.09,"d":"9.00%"},{"v":2508.72,"d":"2,508.72"},{"v":0.11,"d":"11.00%"},{"v":2508.72,"d":"2,508.72"},{"v":0.11,"d":"11.00%"},{"v":275.95919999999995,"d":"275.96"}]
["2004-11-01",752.62,{"v":0.0765,"d":"7.65%"},{"v":780,"d":"780.00"},{"v":0.0865,"d":"8.65%"},{"v":1254.36,"d":"1,254.36"},{"v":0.09,"d":"9.00%"},{"v":2508.72,"d":"2,508.72"},{"v":0.11,"d":"11.00%"},{"v":2508.72,"d":"2,508.72"},{"v":0.11,"d":"11.00%"},{"v":275.95919999999995,"d":"275.96"}]
["2004-12-01",752.62,{"v":0.0765,"d":"7.65%"},{"v":780,"d":"780.00"},{"v":0.0865,"d":"8.65%"},{"v":1254.36,"d":"1,254.36"},{"v":0.09,"d":"9.00%"},{"v":2508.72,"d":"2,508.72"},{"v":0.11,"d":"11.00%"},{"v":2508.72,"d":"2,508.72"},{"v":0.11,"d":"11.00%"},{"v":275.95919999999995,"d":"275.96"}]
["2005-01-01",752.62,{"v":0.0765,"d":"7.65%"},{"v":780,"d":"780.00"},{"v":0.0865,"d":"8.65%"},{"v":1254.36,"d":"1,254.36"},{"v":0.09,"d":"9.00%"},{"v":2508.72,"d":"2,508.72"},{"v":0.11,"d":"11.00%"},{"v":2508.72,"d":"2,508.72"},{"v":0.11,"d":"11.00%"},{"v":275.95919999999995,"d":"275.96"}]
["2005-02-01",752.62,{"v":0.0765,"d":"7.65%"},{"v":780,"d":"780.00"},{"v":0.0865,"d":"8.65%"},{"v":1254.36,"d":"1,254.36"},{"v":0.09,"d":"9.00%"},{"v":2508.72,"d":"2,508.72"},{"v":0.11,"d":"11.00%"},{"v":2508.72,"d":"2,508.72"},{"v":0.11,"d":"11.00%"},{"v":275.95919999999995,"d":"275.96"}]
["2005-03-01",752.62,{"v":0.0765,"d":"7.65%"},{"v":780,"d":"780.00"},{"v":0.0865,"d":"8.65%"},{"v":1254.36,"d":"1,254.36"},{"v":0.09,"d":"9.00%"},{"v":2508.72,"d":"2,508.72"},{"v":0.11,"d":"11.00%"},{"v":2508.72,"d":"2,508.72"},{"v":0.11,"d":"11.00%"},{"v":275.95919999999995,"d":"275.96"}]
["2005-04-01",752.62,{"v":0.0765,"d":"7.65%"},{"v":780,"d":"780.00"},{"v":0.0865,"d":"8.65%"},{"v":1254.36,"d":"1,254.36"},{"v":0.09,"d":"9.00%"},{"v":2508.72,"d":"2,508.72"},{"v":0.11,"d":"11.00%"},{"v":2508.72,"d":"2,508.72"},{"v":0.11,"d":"11.00%"},{"v":275.95919999999995,"d":"275.96"}]
["2005-05-01",800.45,{"v":0.0765,"d":"7.65%"},{"v":900,"d":"900.00"},{"v":0.0865,"d":"8.65%"},{"v":1334.07,"d":"1,334.07"},{"v":0.09,"d":"9.00%"},{"v":2668.15,"d":"2,668.15"},{"v":0.11,"d":"11.00%"},{"v":2668.15,"d":"2,668.15"},{"v":0.11,"d":"11.00%"},{"v":293.4965,"d":"293.50"}]
["2005-06-01",800.45,{"v":0.0765,"d":"7.65%"},{"v":900,"d":"900.00"},{"v":0.0865,"d":"8.65%"},{"v":1334.07,"d":"1,334.07"},{"v":0.09,"d":"9.00%"},{"v":2668.15,"d":"2,668.15"},{"v":0.11,"d":"11.00%"},{"v":2668.15,"d":"2,668.15"},{"v":0.11,"d":"11.00%"},{"v":293.4965,"d":"293.50"}]
["2005-07-01",800.45,{"v":0.0765,"d":"7.65%"},{"v":900,"d":"900.00"},{"v":0.0865,"d":"8.65%"},{"v":1334.07,"d":"1,334.07"},{"v":0.09,"d":"9.00%"},{"v":2668.15,"d":"2,668.15"},{"v":0.11,"d":"11.00%"},{"v":2668.15,"d":"2,668.15"},{"v":0.11,"d":"11.00%"},{"v":293.4965,"d":"293.50"}]
["2005-08-01",800.45,{"v":0.0765,"d":"7.65%"},{"v":900,"d":"900.00"},{"v":0.0865,"d":"8.65%"},{"v":1334.07,"d":"1,334.07"},{"v":0.09,"d":"9.00%"},{"v":2668.15,"d":"2,668.15"},{"v":0.11,"d":"11.00%"},{"v":2668.15,"d":"2,668.15"},{"v":0.11,"d":"11.00%"},{"v":293.4965,"d":"293.50"}]
["2005-09-01",800.45,{"v":0.0765,"d":"7.65%"},{"v":900,"d":"900.00"},{"v":0.0865,"d":"8.65%"},{"v":1334.07,"d":"1,334.07"},{"v":0.09,"d":"9.00%"},{"v":2668.15,"d":"2,668.15"},{"v":0.11,"d":"11.00%"},{"v":2668.15,"d":"2,668.15"},{"v":0.11,"d":"11.00%"},{"v":293.4965,"d":"293.50"}]
["2005-10-01",800.45,{"v":0.0765,"d":"7.65%"},{"v":900,"d":"900.00"},{"v":0.0865,"d":"8.65%"},{"v":1334.07,"d":"1,334.07"},{"v":0.09,"d":"9.00%"},{"v":2668.15,"d":"2,668.15"},{"v":0.11,"d":"11.00%"},{"v":2668.15,"d":"2,668.15"},{"v":0.11,"d":"11.00%"},{"v":293.4965,"d":"293.50"}]
["2005-11-01",800.45,{"v":0.0765,"d":"7.65%"},{"v":900,"d":"900.00"},{"v":0.0865,"d":"8.65%"},{"v":1334.07,"d":"1,334.07"},{"v":0.09,"d":"9.00%"},{"v":2668.15,"d":"2,668.15"},{"v":0.11,"d":"11.00%"},{"v":2668.15,"d":"2,668.15"},{"v":0.11,"d":"11.00%"},{"v":293.4965,"d":"293.50"}]
["2005-12-01",800.45,{"v":0.0765,"d":"7.65%"},{"v":900,"d":"900.00"},{"v":0.0865,"d":"8.65%"},{"v":1334.07,"d":"1,334.07"},{"v":0.09,"d":"9.00%"},{"v":2668.15,"d":"2,668.15"},{"v":0.11,"d":"11.00%"},{"v":2668.15,"d":"2,668.15"},{"v":0.11,"d":"11.00%"},{"v":293.4965,"d":"293.50"}]
["2006-01-01",800.45,{"v":0.0765,"d":"7.65%"},{"v":900,"d":"900.00"},{"v":0.0865,"d":"8.65%"},{"v":1334.07,"d":"1,334.07"},{"v":0.09,"d":"9.00%"},{"v":2668.15,"d":"2,668.15"},{"v":0.11,"d":"11.00%"},{"v":2668.15,"d":"2,668.15"},{"v":0.11,"d":"11.00%"},{"v":293.4965,"d":"293.50"}]
["2006-02-01",800.45,{"v":0.0765,"d":"7.65%"},{"v":900,"d":"900.00"},{"v":0.0865,"d":"8.65%"},{"v":1334.07,"d":"1,334.07"},{"v":0.09,"d":"9.00%"},{"v":2668.15,"d":"2,668.15"},{"v":0.11,"d":"11.00%"},{"v":2668.15,"d":"2,668.15"},{"v":0.11,"d":"11.00%"},{"v":293.4965,"d":"293.50"}]
["2006-03-01",800.45,{"v":0.0765,"d":"7.65%"},{"v":900,"d":"900.00"},{"v":0.0865,"d":"8.65%"},{"v":1334.07,"d":"1,334.07"},{"v":0.09,"d":"9.00%"},{"v":2668.15,"d":"2,668.15"},{"v":0.11,"d":"11.00%"},{"v":2668.15,"d":"2,668.15"},{"v":0.11,"d":"11.00%"},{"v":293.4965,"d":"293.50"}]
["2006-04-01",840.47,{"v":0.0765,"d":"7.65%"},{"v":1050,"d":"1,050.00"},{"v":0.0865,"d":"8.65%"},{"v":1400.77,"d":"1,400.77"},{"v":0.09,"d":"9.00%"},{"v":2801.56,"d":"2,801.56"},{"v":0.11,"d":"11.00%"},{"v":2801.56,"d":"2,801.56"},{"v":0.11,"d":"11.00%"},{"v":308.1716,"d":"308.17"}]
["2006-05-01",840.47,{"v":0.0765,"d":"7.65%"},{"v":1050,"d":"1,050.00"},{"v":0.0865,"d":"8.65%"},{"v":1400.77,"d":"1,400.77"},{"v":0.09,"d":"9.00%"},{"v":2801.56,"d":"2,801.56"},{"v":0.11,"d":"11.00%"},{"v":2801.56,"d":"2,801.56"},{"v":0.11,"d":"11.00%"},{"v":308.1716,"d":"308.17"}]
["2006-06-01",840.47,{"v":0.0765,"d":"7.65%"},{"v":1050,"d":"1,050.00"},{"v":0.0865,"d":"8.65%"},{"v":1400.77,"d":"1,400.77"},{"v":0.09,"d":"9.00%"},{"v":2801.56,"d":"2,801.56"},{"v":0.11,"d":"11.00%"},{"v":2801.56,"d":"2,801.56"},{"v":0.11,"d":"11.00%"},{"v":308.1716,"d":"308.17"}]
["2006-07-01",840.47,{"v":0.0765,"d":"7.65%"},{"v":1050,"d":"1,050.00"},{"v":0.0865,"d":"8.65%"},{"v":1400.77,"d":"1,400.77"},{"v":0.09,"d":"9.00%"},{"v":2801.56,"d":"2,801.56"},{"v":0.11,"d":"11.00%"},{"v":2801.56,"d":"2,801.56"},{"v":0.11,"d":"11.00%"},{"v":308.1716,"d":"308.17"}]
["2006-08-01",840.55,{"v":0.0765,"d":"7.65%"},{"v":1050,"d":"1,050.00"},{"v":0.0865,"d":"8.65%"},{"v":1400.91,"d":"1,400.91"},{"v":0.09,"d":"9.00%"},{"v":2801.82,"d":"2,801.82"},{"v":0.11,"d":"11.00%"},{"v":2801.82,"d":"2,801.82"},{"v":0.11,"d":"11.00%"},{"v":308.2002,"d":"308.20"}]
["2006-09-01",840.55,{"v":0.0765,"d":"7.65%"},{"v":1050,"d":"1,050.00"},{"v":0.0865,"d":"8.65%"},{"v":1400.91,"d":"1,400.91"},{"v":0.09,"d":"9.00%"},{"v":2801.82,"d":"2,801.82"},{"v":0.11,"d":"11.00%"},{"v":2801.82,"d":"2,801.82"},{"v":0.11,"d":"11.00%"},{"v":308.2002,"d":"308.20"}]
["2006-10-01",840.55,{"v":0.0765,"d":"7.65%"},{"v":1050,"d":"1,050.00"},{"v":0.0865,"d":"8.65%"},{"v":1400.91,"d":"1,400.91"},{"v":0.09,"d":"9.00%"},{"v":2801.82,"d":"2,801.82"},{"v":0.11,"d":"11.00%"},{"v":2801.82,"d":"2,801.82"},{"v":0.11,"d":"11.00%"},{"v":308.2002,"d":"308.20"}]
["2006-11-01",840.55,{"v":0.0765,"d":"7.65%"},{"v":1050,"d":"1,050.00"},{"v":0.0865,"d":"8.65%"},{"v":1400.91,"d":"1,400.91"},{"v":0.09,"d":"9.00%"},{"v":2801.82,"d":"2,801.82"},{"v":0.11,"d":"11.00%"},{"v":2801.82,"d":"2,801.82"},{"v":0.11,"d":"11.00%"},{"v":308.2002,"d":"308.20"}]
["2006-12-01",840.55,{"v":0.0765,"d":"7.65%"},{"v":1050,"d":"1,050.00"},{"v":0.0865,"d":"8.65%"},{"v":1400.91,"d":"1,400.91"},{"v":0.09,"d":"9.00%"},{"v":2801.82,"d":"2,801.82"},{"v":0.11,"d":"11.00%"},{"v":2801.82,"d":"2,801.82"},{"v":0.11,"d":"11.00%"},{"v":308.2002,"d":"308.20"}]
["2007-01-01",840.55,{"v":0.0765,"d":"7.65%"},{"v":1050,"d":"1,050.00"},{"v":0.0865,"d":"8.65%"},{"v":1400.91,"d":"1,400.91"},{"v":0.09,"d":"9.00%"},{"v":2801.82,"d":"2,801.82"},{"v":0.11,"d":"11.00%"},{"v":2801.82,"d":"2,801.82"},{"v":0.11,"d":"11.00%"},{"v":308.2002,"d":"308.20"}]
["2007-02-01",840.55,{"v":0.0765,"d":"7.65%"},{"v":1050,"d":"1,050.00"},{"v":0.0865,"d":"8.65%"},{"v":1400.91,"d":"1,400.91"},{"v":0.09,"d":"9.00%"},{"v":2801.82,"d":"2,801.82"},{"v":0.11,"d":"11.00%"},{"v":2801.82,"d":"2,801.82"},{"v":0.11,"d":"11.00%"},{"v":308.2002,"d":"308.20"}]
["2007-03-01",840.55,{"v":0.0765,"d":"7.65%"},{"v":1050,"d":"1,050.00"},{"v":0.0865,"d":"8.65%"},{"v":1400.91,"d":"1,400.91"},{"v":0.09,"d":"9.00%"},{"v":2801.82,"d":"2,801.82"},{"v":0.11,"d":"11.00%"},{"v":2801.82,"d":"2,801.82"},{"v":0.11,"d":"11.00%"},{"v":308.2002,"d":"308.20"}]
["2007-04-01",868.29,{"v":0.0765,"d":"7.65%"},{"v":1140,"d":"1,140.00"},{"v":0.0865,"d":"8.65%"},{"v":1447.14,"d":"1,447.14"},{"v":0.09,"d":"9.00%"},{"v":2894.28,"d":"2,894.28"},{"v":0.11,"d":"11.00%"},{"v":2894.28,"d":"2,894.28"},{"v":0.11,"d":"11.00%"},{"v":318.37080000000003,"d":"318.37"}]
["2007-05-01",868.29,{"v":0.0765,"d":"7.65%"},{"v":1140,"d":"1,140.00"},{"v":0.0865,"d":"8.65%"},{"v":1447.14,"d":"1,447.14"},{"v":0.09,"d":"9.00%"},{"v":2894.28,"d":"2,894.28"},{"v":0.11,"d":"11.00%"},{"v":2894.28,"d":"2,894.28"},{"v":0.11,"d":"11.00%"},{"v":318.37080000000003,"d":"318.37"}]
["2007-06-01",868.29,{"v":0.0765,"d":"7.65%"},{"v":1140,"d":"1,140.00"},{"v":0.0865,"d":"8.65%"},{"v":1447.14,"d":"1,447.14"},{"v":0.09,"d":"9.00%"},{"v":2894.28,"d":"2,894.28"},{"v":0.11,"d":"11.00%"},{"v":2894.28,"d":"2,894.28"},{"v":0.11,"d":"11.00%"},{"v":318.37080000000003,"d":"318.37"}]
["2007-07-01",868.29,{"v":0.0765,"d":"7.65%"},{"v":1140,"d":"1,140.00"},{"v":0.0865,"d":"8.65%"},{"v":1447.14,"d":"1,447.14"},{"v":0.09,"d":"9.00%"},{"v":2894.28,"d":"2,894.28"},{"v":0.11,"d":"11.00%"},{"v":2894.28,"d":"2,894.28"},{"v":0.11,"d":"11.00%"},{"v":318.37080000000003,"d":"318.37"}]
["2007-08-01",868.29,{"v":0.0765,"d":"7.65%"},{"v":1140,"d":"1,140.00"},{"v":0.0865,"d":"8.65%"},{"v":1447.14,"d":"1,447.14"},{"v":0.09,"d":"9.00%"},{"v":2894.28,"d":"2,894.28"},{"v":0.11,"d":"11.00%"},{"v":2894.28,"d":"2,894.28"},{"v":0.11,"d":"11.00%"},{"v":318.37080000000003,"d":"318.37"}]
["2007-09-01",868.29,{"v":0.0765,"d":"7.65%"},{"v":1140,"d":"1,140.00"},{"v":0.0865,"d":"8.65%"},{"v":1447.14,"d":"1,447.14"},{"v":0.09,"d":"9.00%"},{"v":2894.28,"d":"2,894.28"},{"v":0.11,"d":"11.00%"},{"v":2894.28,"d":"2,894.28"},{"v":0.11,"d":"11.00%"},{"v":318.37080000000003,"d":"318.37"}]
["2007-10-01",868.29,{"v":0.0765,"d":"7.65%"},{"v":1140,"d":"1,140.00"},{"v":0.0865,"d":"8.65%"},{"v":1447.14,"d":"1,447.14"},{"v":0.09,"d":"9.00%"},{"v":2894.28,"d":"2,894.28"},{"v":0.11,"d":"11.00%"},{"v":2894.28,"d":"2,894.28"},{"v":0.11,"d":"11.00%"},{"v":318.37080000000003,"d":"318.37"}]
["2007-11-01",868.29,{"v":0.0765,"d":"7.65%"},{"v":1140,"d":"1,140.00"},{"v":0.0865,"d":"8.65%"},{"v":1447.14,"d":"1,447.14"},{"v":0.09,"d":"9.00%"},{"v":2894.28,"d":"2,894.28"},{"v":0.11,"d":"11.00%"},{"v":2894.28,"d":"2,894.28"},{"v":0.11,"d":"11.00%"},{"v":318.37080000000003,"d":"318.37"}]
["2007-12-01",868.29,{"v":0.0765,"d":"7.65%"},{"v":1140,"d":"1,140.00"},{"v":0.0865,"d":"8.65%"},{"v":1447.14,"d":"1,447.14"},{"v":0.09,"d":"9.00%"},{"v":2894.28,"d":"2,894.28"},{"v":0.11,"d":"11.00%"},{"v":2894.28,"d":"2,894.28"},{"v":0.11,"d":"11.00%"},{"v":318.37080000000003,"d":"318.37"}]
["2008-01-01",868.29,{"v":0.08,"d":"8.00%"},{"v":1447.14,"d":"1,447.14"},{"v":0.09,"d":"9.00%"},{"v":2894.28,"d":"2,894.28"},{"v":0.11,"d":"11.00%"},{"v":2894.28,"d":"2,894.28"},{"v":0.11,"d":"11.00%"},{"v":2894.28,"d":"2,894.28"},{"v":0.11,"d":"11.00%"},{"v":318.37080000000003,"d":"318.37"}]
["2008-02-01",868.29,{"v":0.08,"d":"8.00%"},{"v":1447.14,"d":"1,447.14"},{"v":0.09,"d":"9.00%"},{"v":2894.28,"d":"2,894.28"},{"v":0.11,"d":"11.00%"},{"v":2894.28,"d":"2,894.28"},{"v":0.11,"d":"11.00%"},{"v":2894.28,"d":"2,894.28"},{"v":0.11,"d":"11.00%"},{"v":318.37080000000003,"d":"318.37"}]
["2008-03-01",{"v":911.7,"d":"911.70"},{"v":0.08,"d":"8.00%"},{"v":1519.5,"d":"1,519.50"},{"v":0.09,"d":"9.00%"},{"v":3038.99,"d":"3,038.99"},{"v":0.11,"d":"11.00%"},{"v":3038.99,"d":"3,038.99"},{"v":0.11,"d":"11.00%"},{"v":3038.99,"d":"3,038.99"},{"v":0.11,"d":"11.00%"},{"v":334.28889999999996,"d":"334.29"}]
["2008-04-01",{"v":911.7,"d":"911.70"},{"v":0.08,"d":"8.00%"},{"v":1519.5,"d":"1,519.50"},{"v":0.09,"d":"9.00%"},{"v":3038.99,"d":"3,038.99"},{"v":0.11,"d":"11.00%"},{"v":3038.99,"d":"3,038.99"},{"v":0.11,"d":"11.00%"},{"v":3038.99,"d":"3,038.99"},{"v":0.11,"d":"11.00%"},{"v":334.28889999999996,"d":"334.29"}]
["2008-05-01",{"v":911.7,"d":"911.70"},{"v":0.08,"d":"8.00%"},{"v":1519.5,"d":"1,519.50"},{"v":0.09,"d":"9.00%"},{"v":3038.99,"d":"3,038.99"},{"v":0.11,"d":"11.00%"},{"v":3038.99,"d":"3,038.99"},{"v":0.11,"d":"11.00%"},{"v":3038.99,"d":"3,038.99"},{"v":0.11,"d":"11.00%"},{"v":334.28889999999996,"d":"334.29"}]
["2008-06-01",{"v":911.7,"d":"911.70"},{"v":0.08,"d":"8.00%"},{"v":1519.5,"d":"1,519.50"},{"v":0.09,"d":"9.00%"},{"v":3038.99,"d":"3,038.99"},{"v":0.11,"d":"11.00%"},{"v":3038.99,"d":"3,038.99"},{"v":0.11,"d":"11.00%"},{"v":3038.99,"d":"3,038.99"},{"v":0.11,"d":"11.00%"},{"v":334.28889999999996,"d":"334.29"}]
["2008-07-01",{"v":911.7,"d":"911.70"},{"v":0.08,"d":"8.00%"},{"v":1519.5,"d":"1,519.50"},{"v":0.09,"d":"9.00%"},{"v":3038.99,"d":"3,038.99"},{"v":0.11,"d":"11.00%"},{"v":3038.99,"d":"3,038.99"},{"v":0.11,"d":"11.00%"},{"v":3038.99,"d":"3,038.99"},{"v":0.11,"d":"11.00%"},{"v":334.28889999999996,"d":"334.29"}]
["2008-08-01",{"v":911.7,"d":"911.70"},{"v":0.08,"d":"8.00%"},{"v":1519.5,"d":"1,519.50"},{"v":0.09,"d":"9.00%"},{"v":3038.99,"d":"3,038.99"},{"v":0.11,"d":"11.00%"},{"v":3038.99,"d":"3,038.99"},{"v":0.11,"d":"11.00%"},{"v":3038.99,"d":"3,038.99"},{"v":0.11,"d":"11.00%"},{"v":334.28889999999996,"d":"334.29"}]
["2008-09-01",{"v":911.7,"d":"911.70"},{"v":0.08,"d":"8.00%"},{"v":1519.5,"d":"1,519.50"},{"v":0.09,"d":"9.00%"},{"v":3038.99,"d":"3,038.99"},{"v":0.11,"d":"11.00%"},{"v":3038.99,"d":"3,038.99"},{"v":0.11,"d":"11.00%"},{"v":3038.99,"d":"3,038.99"},{"v":0.11,"d":"11.00%"},{"v":334.28889999999996,"d":"334.29"}]
["2008-10-01",{"v":911.7,"d":"911.70"},{"v":0.08,"d":"8.00%"},{"v":1519.5,"d":"1,519.50"},{"v":0.09,"d":"9.00%"},{"v":3038.99,"d":"3,038.99"},{"v":0.11,"d":"11.00%"},{"v":3038.99,"d":"3,038.99"},{"v":0.11,"d":"11.00%"},{"v":3038.99,"d":"3,038.99"},{"v":0.11,"d":"11.00%"},{"v":334.28889999999996,"d":"334.29"}]
["2008-11-01",{"v":911.7,"d":"911.70"},{"v":0.08,"d":"8.00%"},{"v":1519.5,"d":"1,519.50"},{"v":0.09,"d":"9.00%"},{"v":3038.99,"d":"3,038.99"},{"v":0.11,"d":"11.00%"},{"v":3038.99,"d":"3,038.99"},{"v":0.11,"d":"11.00%"},{"v":3038.99,"d":"3,038.99"},{"v":0.11,"d":"11.00%"},{"v":334.28889999999996,"d":"334.29"}]
["2008-12-01",{"v":911.7,"d":"911.70"},{"v":0.08,"d":"8.00%"},{"v":1519.5,"d":"1,519.50"},{"v":0.09,"d":"9.00%"},{"v":3038.99,"d":"3,038.99"},{"v":0.11,"d":"11.00%"},{"v":3038.99,"d":"3,038.99"},{"v":0.11,"d":"11.00%"},{"v":3038.99,"d":"3,038.99"},{"v":0.11,"d":"11.00%"},{"v":334.28889999999996,"d":"334.29"}]
["2009-01-01",{"v":911.7,"d":"911.70"},{"v":0.08,"d":"8.00%"},{"v":1519.5,"d":"1,519.50"},{"v":0.09,"d":"9.00%"},{"v":3038.99,"d":"3,038.99"},{"v":0.11,"d":"11.00%"},{"v":3038.99,"d":"3,038.99"},{"v":0.11,"d":"11.00%"},{"v":3038.99,"d":"3,038.99"},{"v":0.11,"d":"11.00%"},{"v":334.28889999999996,"d":"334.29"}]
["2009-02-01",965.68,{"v":0.08,"d":"8.00%"},{"v":1609.45,"d":"1,609.45"},{"v":0.09,"d":"9.00%"},{"v":3218.9,"d":"3,218.90"},{"v":0.11,"d":"11.00%"},{"v":3218.9,"d":"3,218.90"},{"v":0.11,"d":"11.00%"},{"v":3218.9,"d":"3,218.90"},{"v":0.11,"d":"11.00%"},{"v":354.079,"d":"354.08"}]
["2009-03-01",965.68,{"v":0.08,"d":"8.00%"},{"v":1609.45,"d":"1,609.45"},{"v":0.09,"d":"9.00%"},{"v":3218.9,"d":"3,218.90"},{"v":0.11,"d":"11.00%"},{"v":3218.9,"d":"3,218.90"},{"v":0.11,"d":"11.00%"},{"v":3218.9,"d":"3,218.90"},{"v":0.11,"d":"11.00%"},{"v":354.079,"d":"354.08"}]
["2009-04-01",965.68,{"v":0.08,"d":"8.00%"},{"v":1609.45,"d":"1,609.45"},{"v":0.09,"d":"9.00%"},{"v":3218.9,"d":"3,218.90"},{"v":0.11,"d":"11.00%"},{"v":3218.9,"d":"3,218.90"},{"v":0.11,"d":"11.00%"},{"v":3218.9,"d":"3,218.90"},{"v":0.11,"d":"11.00%"},{"v":354.079,"d":"354.08"}]
["2009-05-01",965.68,{"v":0.08,"d":"8.00%"},{"v":1609.45,"d":"1,609.45"},{"v":0.09,"d":"9.00%"},{"v":3218.9,"d":"3,218.90"},{"v":0.11,"d":"11.00%"},{"v":3218.9,"d":"3,218.90"},{"v":0.11,"d":"11.00%"},{"v":3218.9,"d":"3,218.90"},{"v":0.11,"d":"11.00%"},{"v":354.079,"d":"354.08"}]
["2009-06-01",965.68,{"v":0.08,"d":"8.00%"},{"v":1609.45,"d":"1,609.45"},{"v":0.09,"d":"9.00%"},{"v":3218.9,"d":"3,218.90"},{"v":0.11,"d":"11.00%"},{"v":3218.9,"d":"3,218.90"},{"v":0.11,"d":"11.00%"},{"v":3218.9,"d":"3,218.90"},{"v":0.11,"d":"11.00%"},{"v":354.079,"d":"354.08"}]
["2009-07-01",965.68,{"v":0.08,"d":"8.00%"},{"v":1609.45,"d":"1,609.45"},{"v":0.09,"d":"9.00%"},{"v":3218.9,"d":"3,218.90"},{"v":0.11,"d":"11.00%"},{"v":3218.9,"d":"3,218.90"},{"v":0.11,"d":"11.00%"},{"v":3218.9,"d":"3,218.90"},{"v":0.11,"d":"11.00%"},{"v":354.079,"d":"354.08"}]
["2009-08-01",965.68,{"v":0.08,"d":"8.00%"},{"v":1609.45,"d":"1,609.45"},{"v":0.09,"d":"9.00%"},{"v":3218.9,"d":"3,218.90"},{"v":0.11,"d":"11.00%"},{"v":3218.9,"d":"3,218.90"},{"v":0.11,"d":"11.00%"},{"v":3218.9,"d":"3,218.90"},{"v":0.11,"d":"11.00%"},{"v":354.079,"d":"354.08"}]
["2009-09-01",965.68,{"v":0.08,"d":"8.00%"},{"v":1609.45,"d":"1,609.45"},{"v":0.09,"d":"9.00%"},{"v":3218.9,"d":"3,218.90"},{"v":0.11,"d":"11.00%"},{"v":3218.9,"d":"3,218.90"},{"v":0.11,"d":"11.00%"},{"v":3218.9,"d":"3,218.90"},{"v":0.11,"d":"11.00%"},{"v":354.079,"d":"354.08"}]
["2009-10-01",965.68,{"v":0.08,"d":"8.00%"},{"v":1609.45,"d":"1,609.45"},{"v":0.09,"d":"9.00%"},{"v":3218.9,"d":"3,218.90"},{"v":0.11,"d":"11.00%"},{"v":3218.9,"d":"3,218.90"},{"v":0.11,"d":"11.00%"},{"v":3218.9,"d":"3,218.90"},{"v":0.11,"d":"11.00%"},{"v":354.079,"d":"354.08"}]
["2009-11-01",965.68,{"v":0.08,"d":"8.00%"},{"v":1609.45,"d":"1,609.45"},{"v":0.09,"d":"9.00%"},{"v":3218.9,"d":"3,218.90"},{"v":0.11,"d":"11.00%"},{"v":3218.9,"d":"3,218.90"},{"v":0.11,"d":"11.00%"},{"v":3218.9,"d":"3,218.90"},{"v":0.11,"d":"11.00%"},{"v":354.079,"d":"354.08"}]
["2009-12-01",965.68,{"v":0.08,"d":"8.00%"},{"v":1609.45,"d":"1,609.45"},{"v":0.09,"d":"9.00%"},{"v":3218.9,"d":"3,218.90"},{"v":0.11,"d":"11.00%"},{"v":3218.9,"d":"3,218.90"},{"v":0.11,"d":"11.00%"},{"v":3218.9,"d":"3,218.90"},{"v":0.11,"d":"11.00%"},{"v":354.079,"d":"354.08"}]
["2010-01-01",{"v":1024.97,"d":"1,024.97"},{"v":0.08,"d":"8.00%"},{"v":1708.27,"d":"1,708.27"},{"v":0.09,"d":"9.00%"},{"v":3416.54,"d":"3,416.54"},{"v":0.11,"d":"11.00%"},{"v":3416.54,"d":"3,416.54"},{"v":0.11,"d":"11.00%"},{"v":3416.54,"d":"3,416.54"},{"v":0.11,"d":"11.00%"},{"v":375.8194,"d":"375.82"}]
["2010-02-01",{"v":1024.97,"d":"1,024.97"},{"v":0.08,"d":"8.00%"},{"v":1708.27,"d":"1,708.27"},{"v":0.09,"d":"9.00%"},{"v":3416.54,"d":"3,416.54"},{"v":0.11,"d":"11.00%"},{"v":3416.54,"d":"3,416.54"},{"v":0.11,"d":"11.00%"},{"v":3416.54,"d":"3,416.54"},{"v":0.11,"d":"11.00%"},{"v":375.8194,"d":"375.82"}]
["2010-03-01",{"v":1024.97,"d":"1,024.97"},{"v":0.08,"d":"8.00%"},{"v":1708.27,"d":"1,708.27"},{"v":0.09,"d":"9.00%"},{"v":3416.54,"d":"3,416.54"},{"v":0.11,"d":"11.00%"},{"v":3416.54,"d":"3,416.54"},{"v":0.11,"d":"11.00%"},{"v":3416.54,"d":"3,416.54"},{"v":0.11,"d":"11.00%"},{"v":375.8194,"d":"375.82"}]
["2010-04-01",{"v":1024.97,"d":"1,024.97"},{"v":0.08,"d":"8.00%"},{"v":1708.27,"d":"1,708.27"},{"v":0.09,"d":"9.00%"},{"v":3416.54,"d":"3,416.54"},{"v":0.11,"d":"11.00%"},{"v":3416.54,"d":"3,416.54"},{"v":0.11,"d":"11.00%"},{"v":3416.54,"d":"3,416.54"},{"v":0.11,"d":"11.00%"},{"v":375.8194,"d":"375.82"}]
["2010-05-01",{"v":1024.97,"d":"1,024.97"},{"v":0.08,"d":"8.00%"},{"v":1708.27,"d":"1,708.27"},{"v":0.09,"d":"9.00%"},{"v":3416.54,"d":"3,416.54"},{"v":0.11,"d":"11.00%"},{"v":3416.54,"d":"3,416.54"},{"v":0.11,"d":"11.00%"},{"v":3416.54,"d":"3,416.54"},{"v":0.11,"d":"11.00%"},{"v":375.8194,"d":"375.82"}]
["2010-06-01",{"v":1040.22,"d":"1,040.22"},{"v":0.08,"d":"8.00%"},{"v":1733.7,"d":"1,733.70"},{"v":0.09,"d":"9.00%"},{"v":3467.4,"d":"3,467.40"},{"v":0.11,"d":"11.00%"},{"v":3467.4,"d":"3,467.40"},{"v":0.11,"d":"11.00%"},{"v":3467.4,"d":"3,467.40"},{"v":0.11,"d":"11.00%"},{"v":381.414,"d":"381.41"}]
["2010-07-01",{"v":1040.22,"d":"1,040.22"},{"v":0.08,"d":"8.00%"},{"v":1733.7,"d":"1,733.70"},{"v":0.09,"d":"9.00%"},{"v":3467.4,"d":"3,467.40"},{"v":0.11,"d":"11.00%"},{"v":3467.4,"d":"3,467.40"},{"v":0.11,"d":"11.00%"},{"v":3467.4,"d":"3,467.40"},{"v":0.11,"d":"11.00%"},{"v":381.414,"d":"381.41"}]
["2010-08-01",{"v":1040.22,"d":"1,040.22"},{"v":0.08,"d":"8.00%"},{"v":1733.7,"d":"1,733.70"},{"v":0.09,"d":"9.00%"},{"v":3467.4,"d":"3,467.40"},{"v":0.11,"d":"11.00%"},{"v":3467.4,"d":"3,467.40"},{"v":0.11,"d":"11.00%"},{"v":3467.4,"d":"3,467.40"},{"v":0.11,"d":"11.00%"},{"v":381.414,"d":"381.41"}]
["2010-09-01",{"v":1040.22,"d":"1,040.22"},{"v":0.08,"d":"8.00%"},{"v":1733.7,"d":"1,733.70"},{"v":0.09,"d":"9.00%"},{"v":3467.4,"d":"3,467.40"},{"v":0.11,"d":"11.00%"},{"v":3467.4,"d":"3,467.40"},{"v":0.11,"d":"11.00%"},{"v":3467.4,"d":"3,467.40"},{"v":0.11,"d":"11.00%"},{"v":381.414,"d":"381.41"}]
["2010-10-01",{"v":1040.22,"d":"1,040.22"},{"v":0.08,"d":"8.00%"},{"v":1733.7,"d":"1,733.70"},{"v":0.09,"d":"9.00%"},{"v":3467.4,"d":"3,467.40"},{"v":0.11,"d":"11.00%"},{"v":3467.4,"d":"3,467.40"},{"v":0.11,"d":"11.00%"},{"v":3467.4,"d":"3,467.40"},{"v":0.11,"d":"11.00%"},{"v":381.414,"d":"381.41"}]
["2010-11-01",{"v":1040.22,"d":"1,040.22"},{"v":0.08,"d":"8.00%"},{"v":1733.7,"d":"1,733.70"},{"v":0.09,"d":"9.00%"},{"v":3467.4,"d":"3,467.40"},{"v":0.11,"d":"11.00%"},{"v":3467.4,"d":"3,467.40"},{"v":0.11,"d":"11.00%"},{"v":3467.4,"d":"3,467.40"},{"v":0.11,"d":"11.00%"},{"v":381.414,"d":"381.41"}]
["2010-12-01",{"v":1040.22,"d":"1,040.22"},{"v":0.08,"d":"8.00%"},{"v":1733.7,"d":"1,733.70"},{"v":0.09,"d":"9.00%"},{"v":3467.4,"d":"3,467.40"},{"v":0.11,"d":"11.00%"},{"v":3467.4,"d":"3,467.40"},{"v":0.11,"d":"11.00%"},{"v":3467.4,"d":"3,467.40"},{"v":0.11,"d":"11.00%"},{"v":381.414,"d":"381.41"}]
["2011-01-01",{"v":1106.9,"d":"1,106.90"},{"v":0.08,"d":"8.00%"},{"v":1844.83,"d":"1,844.83"},{"v":0.09,"d":"9.00%"},{"v":3689.66,"d":"3,689.66"},{"v":0.11,"d":"11.00%"},{"v":3689.66,"d":"3,689.66"},{"v":0.11,"d":"11.00%"},{"v":3689.66,"d":"3,689.66"},{"v":0.11,"d":"11.00%"},{"v":405.8626,"d":"405.86"}]
["2011-02-01",{"v":1106.9,"d":"1,106.90"},{"v":0.08,"d":"8.00%"},{"v":1844.83,"d":"1,844.83"},{"v":0.09,"d":"9.00%"},{"v":3689.66,"d":"3,689.66"},{"v":0.11,"d":"11.00%"},{"v":3689.66,"d":"3,689.66"},{"v":0.11,"d":"11.00%"},{"v":3689.66,"d":"3,689.66"},{"v":0.11,"d":"11.00%"},{"v":405.8626,"d":"405.86"}]
["2011-03-01",{"v":1106.9,"d":"1,106.90"},{"v":0.08,"d":"8.00%"},{"v":1844.83,"d":"1,844.83"},{"v":0.09,"d":"9.00%"},{"v":3689.66,"d":"3,689.66"},{"v":0.11,"d":"11.00%"},{"v":3689.66,"d":"3,689.66"},{"v":0.11,"d":"11.00%"},{"v":3689.66,"d":"3,689.66"},{"v":0.11,"d":"11.00%"},{"v":405.8626,"d":"405.86"}]
["2011-04-01",{"v":1106.9,"d":"1,106.90"},{"v":0.08,"d":"8.00%"},{"v":1844.83,"d":"1,844.83"},{"v":0.09,"d":"9.00%"},{"v":3689.66,"d":"3,689.66"},{"v":0.11,"d":"11.00%"},{"v":3689.66,"d":"3,689.66"},{"v":0.11,"d":"11.00%"},{"v":3689.66,"d":"3,689.66"},{"v":0.11,"d":"11.00%"},{"v":405.8626,"d":"405.86"}]
["2011-05-01",{"v":1106.9,"d":"1,106.90"},{"v":0.08,"d":"8.00%"},{"v":1844.83,"d":"1,844.83"},{"v":0.09,"d":"9.00%"},{"v":3689.66,"d":"3,689.66"},{"v":0.11,"d":"11.00%"},{"v":3689.66,"d":"3,689.66"},{"v":0.11,"d":"11.00%"},{"v":3689.66,"d":"3,689.66"},{"v":0.11,"d":"11.00%"},{"v":405.8626,"d":"405.86"}]
["2011-06-01",{"v":1106.9,"d":"1,106.90"},{"v":0.08,"d":"8.00%"},{"v":1844.83,"d":"1,844.83"},{"v":0.09,"d":"9.00%"},{"v":3689.66,"d":"3,689.66"},{"v":0.11,"d":"11.00%"},{"v":3689.66,"d":"3,689.66"},{"v":0.11,"d":"11.00%"},{"v":3689.66,"d":"3,689.66"},{"v":0.11,"d":"11.00%"},{"v":405.8626,"d":"405.86"}]
["2011-07-01",{"v":1107.52,"d":"1,107.52"},{"v":0.08,"d":"8.00%"},{"v":1845.87,"d":"1,845.87"},{"v":0.09,"d":"9.00%"},{"v":3691.74,"d":"3,691.74"},{"v":0.11,"d":"11.00%"},{"v":3691.74,"d":"3,691.74"},{"v":0.11,"d":"11.00%"},{"v":3691.74,"d":"3,691.74"},{"v":0.11,"d":"11.00%"},{"v":406.09139999999996,"d":"406.09"}]
["2011-08-01",{"v":1107.52,"d":"1,107.52"},{"v":0.08,"d":"8.00%"},{"v":1845.87,"d":"1,845.87"},{"v":0.09,"d":"9.00%"},{"v":3691.74,"d":"3,691.74"},{"v":0.11,"d":"11.00%"},{"v":3691.74,"d":"3,691.74"},{"v":0.11,"d":"11.00%"},{"v":3691.74,"d":"3,691.74"},{"v":0.11,"d":"11.00%"},{"v":406.09139999999996,"d":"406.09"}]
["2011-09-01",{"v":1107.52,"d":"1,107.52"},{"v":0.08,"d":"8.00%"},{"v":1845.87,"d":"1,845.87"},{"v":0.09,"d":"9.00%"},{"v":3691.74,"d":"3,691.74"},{"v":0.11,"d":"11.00%"},{"v":3691.74,"d":"3,691.74"},{"v":0.11,"d":"11.00%"},{"v":3691.74,"d":"3,691.74"},{"v":0.11,"d":"11.00%"},{"v":406.09139999999996,"d":"406.09"}]
["2011-10-01",{"v":1107.52,"d":"1,107.52"},{"v":0.08,"d":"8.00%"},{"v":1845.87,"d":"1,845.87"},{"v":0.09,"d":"9.00%"},{"v":3691.74,"d":"3,691.74"},{"v":0.11,"d":"11.00%"},{"v":3691.74,"d":"3,691.74"},{"v":0.11,"d":"11.00%"},{"v":3691.74,"d":"3,691.74"},{"v":0.11,"d":"11.00%"},{"v":406.09139999999996,"d":"406.09"}]
["2011-11-01",{"v":1107.52,"d":"1,107.52"},{"v":0.08,"d":"8.00%"},{"v":1845.87,"d":"1,845.87"},{"v":0.09,"d":"9.00%"},{"v":3691.74,"d":"3,691.74"},{"v":0.11,"d":"11.00%"},{"v":3691.74,"d":"3,691.74"},{"v":0.11,"d":"11.00%"},{"v":3691.74,"d":"3,691.74"},{"v":0.11,"d":"11.00%"},{"v":406.09139999999996,"d":"406.09"}]
["2011-12-01",{"v":1107.52,"d":"1,107.52"},{"v":0.08,"d":"8.00%"},{"v":1845.87,"d":"1,845.87"},{"v":0.09,"d":"9.00%"},{"v":3691.74,"d":"3,691.74"},{"v":0.11,"d":"11.00%"},{"v":3691.74,"d":"3,691.74"},{"v":0.11,"d":"11.00%"},{"v":3691.74,"d":"3,691.74"},{"v":0.11,"d":"11.00%"},{"v":406.09139999999996,"d":"406.09"}]
["2012-01-01",{"v":1174.86,"d":"1,174.86"},{"v":0.08,"d":"8.00%"},{"v":1958.1,"d":"1,958.10"},{"v":0.09,"d":"9.00%"},{"v":3916.2,"d":"3,916.20"},{"v":0.11,"d":"11.00%"},{"v":3916.2,"d":"3,916.20"},{"v":0.11,"d":"11.00%"},{"v":3916.2,"d":"3,916.20"},{"v":0.11,"d":"11.00%"},{"v":430.782,"d":"430.78"}]
["2012-02-01",{"v":1174.86,"d":"1,174.86"},{"v":0.08,"d":"8.00%"},{"v":1958.1,"d":"1,958.10"},{"v":0.09,"d":"9.00%"},{"v":3916.2,"d":"3,916.20"},{"v":0.11,"d":"11.00%"},{"v":3916.2,"d":"3,916.20"},{"v":0.11,"d":"11.00%"},{"v":3916.2,"d":"3,916.20"},{"v":0.11,"d":"11.00%"},{"v":430.782,"d":"430.78"}]
["2012-03-01",{"v":1174.86,"d":"1,174.86"},{"v":0.08,"d":"8.00%"},{"v":1958.1,"d":"1,958.10"},{"v":0.09,"d":"9.00%"},{"v":3916.2,"d":"3,916.20"},{"v":0.11,"d":"11.00%"},{"v":3916.2,"d":"3,916.20"},{"v":0.11,"d":"11.00%"},{"v":3916.2,"d":"3,916.20"},{"v":0.11,"d":"11.00%"},{"v":430.782,"d":"430.78"}]
["2012-04-01",{"v":1174.86,"d":"1,174.86"},{"v":0.08,"d":"8.00%"},{"v":1958.1,"d":"1,958.10"},{"v":0.09,"d":"9.00%"},{"v":3916.2,"d":"3,916.20"},{"v":0.11,"d":"11.00%"},{"v":3916.2,"d":"3,916.20"},{"v":0.11,"d":"11.00%"},{"v":3916.2,"d":"3,916.20"},{"v":0.11,"d":"11.00%"},{"v":430.782,"d":"430.78"}]
["2012-05-01",{"v":1174.86,"d":"1,174.86"},{"v":0.08,"d":"8.00%"},{"v":1958.1,"d":"1,958.10"},{"v":0.09,"d":"9.00%"},{"v":3916.2,"d":"3,916.20"},{"v":0.11,"d":"11.00%"},{"v":3916.2,"d":"3,916.20"},{"v":0.11,"d":"11.00%"},{"v":3916.2,"d":"3,916.20"},{"v":0.11,"d":"11.00%"},{"v":430.782,"d":"430.78"}]
["2012-06-01",{"v":1174.86,"d":"1,174.86"},{"v":0.08,"d":"8.00%"},{"v":1958.1,"d":"1,958.10"},{"v":0.09,"d":"9.00%"},{"v":3916.2,"d":"3,916.20"},{"v":0.11,"d":"11.00%"},{"v":3916.2,"d":"3,916.20"},{"v":0.11,"d":"11.00%"},{"v":3916.2,"d":"3,916.20"},{"v":0.11,"d":"11.00%"},{"v":430.782,"d":"430.78"}]
["2012-07-01",{"v":1174.86,"d":"1,174.86"},{"v":0.08,"d":"8.00%"},{"v":1958.1,"d":"1,958.10"},{"v":0.09,"d":"9.00%"},{"v":3916.2,"d":"3,916.20"},{"v":0.11,"d":"11.00%"},{"v":3916.2,"d":"3,916.20"},{"v":0.11,"d":"11.00%"},{"v":3916.2,"d":"3,916.20"},{"v":0.11,"d":"11.00%"},{"v":430.782,"d":"430.78"}]
["2012-08-01",{"v":1174.86,"d":"1,174.86"},{"v":0.08,"d":"8.00%"},{"v":1958.1,"d":"1,958.10"},{"v":0.09,"d":"9.00%"},{"v":3916.2,"d":"3,916.20"},{"v":0.11,"d":"11.00%"},{"v":3916.2,"d":"3,916.20"},{"v":0.11,"d":"11.00%"},{"v":3916.2,"d":"3,916.20"},{"v":0.11,"d":"11.00%"},{"v":430.782,"d":"430.78"}]
["2012-09-01",{"v":1174.86,"d":"1,174.86"},{"v":0.08,"d":"8.00%"},{"v":1958.1,"d":"1,958.10"},{"v":0.09,"d":"9.00%"},{"v":3916.2,"d":"3,916.20"},{"v":0.11,"d":"11.00%"},{"v":3916.2,"d":"3,916.20"},{"v":0.11,"d":"11.00%"},{"v":3916.2,"d":"3,916.20"},{"v":0.11,"d":"11.00%"},{"v":430.782,"d":"430.78"}]
["2012-10-01",{"v":1174.86,"d":"1,174.86"},{"v":0.08,"d":"8.00%"},{"v":1958.1,"d":"1,958.10"},{"v":0.09,"d":"9.00%"},{"v":3916.2,"d":"3,916.20"},{"v":0.11,"d":"11.00%"},{"v":3916.2,"d":"3,916.20"},{"v":0.11,"d":"11.00%"},{"v":3916.2,"d":"3,916.20"},{"v":0.11,"d":"11.00%"},{"v":430.782,"d":"430.78"}]
["2012-11-01",{"v":1174.86,"d":"1,174.86"},{"v":0.08,"d":"8.00%"},{"v":1958.1,"d":"1,958.10"},{"v":0.09,"d":"9.00%"},{"v":3916.2,"d":"3,916.20"},{"v":0.11,"d":"11.00%"},{"v":3916.2,"d":"3,916.20"},{"v":0.11,"d":"11.00%"},{"v":3916.2,"d":"3,916.20"},{"v":0.11,"d":"11.00%"},{"v":430.782,"d":"430.78"}]
["2012-12-01",{"v":1174.86,"d":"1,174.86"},{"v":0.08,"d":"8.00%"},{"v":1958.1,"d":"1,958.10"},{"v":0.09,"d":"9.00%"},{"v":3916.2,"d":"3,916.20"},{"v":0.11,"d":"11.00%"},{"v":3916.2,"d":"3,916.20"},{"v":0.11,"d":"11.00%"},{"v":3916.2,"d":"3,916.20"},{"v":0.11,"d":"11.00%"},{"v":430.782,"d":"430.78"}]
["2013-01-01",{"v":1247.7,"d":"1,247.70"},{"v":0.08,"d":"8.00%"},{"v":2079.5,"d":"2,079.50"},{"v":0.09,"d":"9.00%"},{"v":4159,"d":"4,159.00"},{"v":0.11,"d":"11.00%"},{"v":4159,"d":"4,159.00"},{"v":0.11,"d":"11.00%"},{"v":4159,"d":"4,159.00"},{"v":0.11,"d":"11.00%"},457.49]
["2013-02-01",{"v":1247.7,"d":"1,247.70"},{"v":0.08,"d":"8.00%"},{"v":2079.5,"d":"2,079.50"},{"v":0.09,"d":"9.00%"},{"v":4159,"d":"4,159.00"},{"v":0.11,"d":"11.00%"},{"v":4159,"d":"4,159.00"},{"v":0.11,"d":"11.00%"},{"v":4159,"d":"4,159.00"},{"v":0.11,"d":"11.00%"},457.49]
["2013-03-01",{"v":1247.7,"d":"1,247.70"},{"v":0.08,"d":"8.00%"},{"v":2079.5,"d":"2,079.50"},{"v":0.09,"d":"9.00%"},{"v":4159,"d":"4,159.00"},{"v":0.11,"d":"11.00%"},{"v":4159,"d":"4,159.00"},{"v":0.11,"d":"11.00%"},{"v":4159,"d":"4,159.00"},{"v":0.11,"d":"11.00%"},457.49]
["2013-04-01",{"v":1247.7,"d":"1,247.70"},{"v":0.08,"d":"8.00%"},{"v":2079.5,"d":"2,079.50"},{"v":0.09,"d":"9.00%"},{"v":4159,"d":"4,159.00"},{"v":0.11,"d":"11.00%"},{"v":4159,"d":"4,159.00"},{"v":0.11,"d":"11.00%"},{"v":4159,"d":"4,159.00"},{"v":0.11,"d":"11.00%"},457.49]
["2013-05-01",{"v":1247.7,"d":"1,247.70"},{"v":0.08,"d":"8.00%"},{"v":2079.5,"d":"2,079.50"},{"v":0.09,"d":"9.00%"},{"v":4159,"d":"4,159.00"},{"v":0.11,"d":"11.00%"},{"v":4159,"d":"4,159.00"},{"v":0.11,"d":"11.00%"},{"v":4159,"d":"4,159.00"},{"v":0.11,"d":"11.00%"},457.49]
["2013-06-01",{"v":1247.7,"d":"1,247.70"},{"v":0.08,"d":"8.00%"},{"v":2079.5,"d":"2,079.50"},{"v":0.09,"d":"9.00%"},{"v":4159,"d":"4,159.00"},{"v":0.11,"d":"11.00%"},{"v":4159,"d":"4,159.00"},{"v":0.11,"d":"11.00%"},{"v":4159,"d":"4,159.00"},{"v":0.11,"d":"11.00%"},457.49]
["2013-07-01",{"v":1247.7,"d":"1,247.70"},{"v":0.08,"d":"8.00%"},{"v":2079.5,"d":"2,079.50"},{"v":0.09,"d":"9.00%"},{"v":4159,"d":"4,159.00"},{"v":0.11,"d":"11.00%"},{"v":4159,"d":"4,159.00"},{"v":0.11,"d":"11.00%"},{"v":4159,"d":"4,159.00"},{"v":0.11,"d":"11.00%"},457.49]
["2013-08-01",{"v":1247.7,"d":"1,247.70"},{"v":0.08,"d":"8.00%"},{"v":2079.5,"d":"2,079.50"},{"v":0.09,"d":"9.00%"},{"v":4159,"d":"4,159.00"},{"v":0.11,"d":"11.00%"},{"v":4159,"d":"4,159.00"},{"v":0.11,"d":"11.00%"},{"v":4159,"d":"4,159.00"},{"v":0.11,"d":"11.00%"},457.49]
["2013-09-01",{"v":1247.7,"d":"1,247.70"},{"v":0.08,"d":"8.00%"},{"v":2079.5,"d":"2,079.50"},{"v":0.09,"d":"9.00%"},{"v":4159,"d":"4,159.00"},{"v":0.11,"d":"11.00%"},{"v":4159,"d":"4,159.00"},{"v":0.11,"d":"11.00%"},{"v":4159,"d":"4,159.00"},{"v":0.11,"d":"11.00%"},457.49]
["2013-10-01",{"v":1247.7,"d":"1,247.70"},{"v":0.08,"d":"8.00%"},{"v":2079.5,"d":"2,079.50"},{"v":0.09,"d":"9.00%"},{"v":4159,"d":"4,159.00"},{"v":0.11,"d":"11.00%"},{"v":4159,"d":"4,159.00"},{"v":0.11,"d":"11.00%"},{"v":4159,"d":"4,159.00"},{"v":0.11,"d":"11.00%"},457.49]
["2013-11-01",{"v":1247.7,"d":"1,247.70"},{"v":0.08,"d":"8.00%"},{"v":2079.5,"d":"2,079.50"},{"v":0.09,"d":"9.00%"},{"v":4159,"d":"4,159.00"},{"v":0.11,"d":"11.00%"},{"v":4159,"d":"4,159.00"},{"v":0.11,"d":"11.00%"},{"v":4159,"d":"4,159.00"},{"v":0.11,"d":"11.00%"},457.49]
["2013-12-01",{"v":1247.7,"d":"1,247.70"},{"v":0.08,"d":"8.00%"},{"v":2079.5,"d":"2,079.50"},{"v":0.09,"d":"9.00%"},{"v":4159,"d":"4,159.00"},{"v":0.11,"d":"11.00%"},{"v":4159,"d":"4,159.00"},{"v":0.11,"d":"11.00%"},{"v":4159,"d":"4,159.00"},{"v":0.11,"d":"11.00%"},457.49]
["2014-01-01",{"v":1317.07,"d":"1,317.07"},{"v":0.08,"d":"8.00%"},{"v":2195.12,"d":"2,195.12"},{"v":0.09,"d":"9.00%"},{"v":4390.24,"d":"4,390.24"},{"v":0.11,"d":"11.00%"},{"v":4390.24,"d":"4,390.24"},{"v":0.11,"d":"11.00%"},{"v":4390.24,"d":"4,390.24"},{"v":0.11,"d":"11.00%"},482.93]
["2014-02-01",{"v":1317.07,"d":"1,317.07"},{"v":0.08,"d":"8.00%"},{"v":2195.12,"d":"2,195.12"},{"v":0.09,"d":"9.00%"},{"v":4390.24,"d":"4,390.24"},{"v":0.11,"d":"11.00%"},{"v":4390.24,"d":"4,390.24"},{"v":0.11,"d":"11.00%"},{"v":4390.24,"d":"4,390.24"},{"v":0.11,"d":"11.00%"},482.93]
["2014-03-01",{"v":1317.07,"d":"1,317.07"},{"v":0.08,"d":"8.00%"},{"v":2195.12,"d":"2,195.12"},{"v":0.09,"d":"9.00%"},{"v":4390.24,"d":"4,390.24"},{"v":0.11,"d":"11.00%"},{"v":4390.24,"d":"4,390.24"},{"v":0.11,"d":"11.00%"},{"v":4390.24,"d":"4,390.24"},{"v":0.11,"d":"11.00%"},482.93]
["2014-04-01",{"v":1317.07,"d":"1,317.07"},{"v":0.08,"d":"8.00%"},{"v":2195.12,"d":"2,195.12"},{"v":0.09,"d":"9.00%"},{"v":4390.24,"d":"4,390.24"},{"v":0.11,"d":"11.00%"},{"v":4390.24,"d":"4,390.24"},{"v":0.11,"d":"11.00%"},{"v":4390.24,"d":"4,390.24"},{"v":0.11,"d":"11.00%"},482.93]
["2014-05-01",{"v":1317.07,"d":"1,317.07"},{"v":0.08,"d":"8.00%"},{"v":2195.12,"d":"2,195.12"},{"v":0.09,"d":"9.00%"},{"v":4390.24,"d":"4,390.24"},{"v":0.11,"d":"11.00%"},{"v":4390.24,"d":"4,390.24"},{"v":0.11,"d":"11.00%"},{"v":4390.24,"d":"4,390.24"},{"v":0.11,"d":"11.00%"},482.93]
["2014-06-01",{"v":1317.07,"d":"1,317.07"},{"v":0.08,"d":"8.00%"},{"v":2195.12,"d":"2,195.12"},{"v":0.09,"d":"9.00%"},{"v":4390.24,"d":"4,390.24"},{"v":0.11,"d":"11.00%"},{"v":4390.24,"d":"4,390.24"},{"v":0.11,"d":"11.00%"},{"v":4390.24,"d":"4,390.24"},{"v":0.11,"d":"11.00%"},482.93]
["2014-07-01",{"v":1317.07,"d":"1,317.07"},{"v":0.08,"d":"8.00%"},{"v":2195.12,"d":"2,195.12"},{"v":0.09,"d":"9.00%"},{"v":4390.24,"d":"4,390.24"},{"v":0.11,"d":"11.00%"},{"v":4390.24,"d":"4,390.24"},{"v":0.11,"d":"11.00%"},{"v":4390.24,"d":"4,390.24"},{"v":0.11,"d":"11.00%"},482.93]
["2014-08-01",{"v":1317.07,"d":"1,317.07"},{"v":0.08,"d":"8.00%"},{"v":2195.12,"d":"2,195.12"},{"v":0.09,"d":"9.00%"},{"v":4390.24,"d":"4,390.24"},{"v":0.11,"d":"11.00%"},{"v":4390.24,"d":"4,390.24"},{"v":0.11,"d":"11.00%"},{"v":4390.24,"d":"4,390.24"},{"v":0.11,"d":"11.00%"},482.93]
["2014-09-01",{"v":1317.07,"d":"1,317.07"},{"v":0.08,"d":"8.00%"},{"v":2195.12,"d":"2,195.12"},{"v":0.09,"d":"9.00%"},{"v":4390.24,"d":"4,390.24"},{"v":0.11,"d":"11.00%"},{"v":4390.24,"d":"4,390.24"},{"v":0.11,"d":"11.00%"},{"v":4390.24,"d":"4,390.24"},{"v":0.11,"d":"11.00%"},482.93]
["2014-10-01",{"v":1317.07,"d":"1,317.07"},{"v":0.08,"d":"8.00%"},{"v":2195.12,"d":"2,195.12"},{"v":0.09,"d":"9.00%"},{"v":4390.24,"d":"4,390.24"},{"v":0.11,"d":"11.00%"},{"v":4390.24,"d":"4,390.24"},{"v":0.11,"d":"11.00%"},{"v":4390.24,"d":"4,390.24"},{"v":0.11,"d":"11.00%"},482.93]
["2014-11-01",{"v":1317.07,"d":"1,317.07"},{"v":0.08,"d":"8.00%"},{"v":2195.12,"d":"2,195.12"},{"v":0.09,"d":"9.00%"},{"v":4390.24,"d":"4,390.24"},{"v":0.11,"d":"11.00%"},{"v":4390.24,"d":"4,390.24"},{"v":0.11,"d":"11.00%"},{"v":4390.24,"d":"4,390.24"},{"v":0.11,"d":"11.00%"},482.93]
["2014-12-01",{"v":1317.07,"d":"1,317.07"},{"v":0.08,"d":"8.00%"},{"v":2195.12,"d":"2,195.12"},{"v":0.09,"d":"9.00%"},{"v":4390.24,"d":"4,390.24"},{"v":0.11,"d":"11.00%"},{"v":4390.24,"d":"4,390.24"},{"v":0.11,"d":"11.00%"},{"v":4390.24,"d":"4,390.24"},{"v":0.11,"d":"11.00%"},482.93]
["2015-01-01",{"v":1399.12,"d":"1,399.12"},{"v":0.08,"d":"8.00%"},{"v":2331.88,"d":"2,331.88"},{"v":0.09,"d":"9.00%"},{"v":4663.75,"d":"4,663.75"},{"v":0.11,"d":"11.00%"},{"v":4663.75,"d":"4,663.75"},{"v":0.11,"d":"11.00%"},{"v":4663.75,"d":"4,663.75"},{"v":0.11,"d":"11.00%"},513.01]
["2015-02-01",{"v":1399.12,"d":"1,399.12"},{"v":0.08,"d":"8.00%"},{"v":2331.88,"d":"2,331.88"},{"v":0.09,"d":"9.00%"},{"v":4663.75,"d":"4,663.75"},{"v":0.11,"d":"11.00%"},{"v":4663.75,"d":"4,663.75"},{"v":0.11,"d":"11.00%"},{"v":4663.75,"d":"4,663.75"},{"v":0.11,"d":"11.00%"},513.01]
["2015-03-01",{"v":1399.12,"d":"1,399.12"},{"v":0.08,"d":"8.00%"},{"v":2331.88,"d":"2,331.88"},{"v":0.09,"d":"9.00%"},{"v":4663.75,"d":"4,663.75"},{"v":0.11,"d":"11.00%"},{"v":4663.75,"d":"4,663.75"},{"v":0.11,"d":"11.00%"},{"v":4663.75,"d":"4,663.75"},{"v":0.11,"d":"11.00%"},513.01]
["2015-04-01",{"v":1399.12,"d":"1,399.12"},{"v":0.08,"d":"8.00%"},{"v":2331.88,"d":"2,331.88"},{"v":0.09,"d":"9.00%"},{"v":4663.75,"d":"4,663.75"},{"v":0.11,"d":"11.00%"},{"v":4663.75,"d":"4,663.75"},{"v":0.11,"d":"11.00%"},{"v":4663.75,"d":"4,663.75"},{"v":0.11,"d":"11.00%"},513.01]
["2015-05-01",{"v":1399.12,"d":"1,399.12"},{"v":0.08,"d":"8.00%"},{"v":2331.88,"d":"2,331.88"},{"v":0.09,"d":"9.00%"},{"v":4663.75,"d":"4,663.75"},{"v":0.11,"d":"11.00%"},{"v":4663.75,"d":"4,663.75"},{"v":0.11,"d":"11.00%"},{"v":4663.75,"d":"4,663.75"},{"v":0.11,"d":"11.00%"},513.01]
["2015-06-01",{"v":1399.12,"d":"1,399.12"},{"v":0.08,"d":"8.00%"},{"v":2331.88,"d":"2,331.88"},{"v":0.09,"d":"9.00%"},{"v":4663.75,"d":"4,663.75"},{"v":0.11,"d":"11.00%"},{"v":4663.75,"d":"4,663.75"},{"v":0.11,"d":"11.00%"},{"v":4663.75,"d":"4,663.75"},{"v":0.11,"d":"11.00%"},513.01]
["2015-07-01",{"v":1399.12,"d":"1,399.12"},{"v":0.08,"d":"8.00%"},{"v":2331.88,"d":"2,331.88"},{"v":0.09,"d":"9.00%"},{"v":4663.75,"d":"4,663.75"},{"v":0.11,"d":"11.00%"},{"v":4663.75,"d":"4,663.75"},{"v":0.11,"d":"11.00%"},{"v":4663.75,"d":"4,663.75"},{"v":0.11,"d":"11.00%"},513.01]
["2015-08-01",{"v":1399.12,"d":"1,399.12"},{"v":0.08,"d":"8.00%"},{"v":2331.88,"d":"2,331.88"},{"v":0.09,"d":"9.00%"},{"v":4663.75,"d":"4,663.75"},{"v":0.11,"d":"11.00%"},{"v":4663.75,"d":"4,663.75"},{"v":0.11,"d":"11.00%"},{"v":4663.75,"d":"4,663.75"},{"v":0.11,"d":"11.00%"},513.01]
["2015-09-01",{"v":1399.12,"d":"1,399.12"},{"v":0.08,"d":"8.00%"},{"v":2331.88,"d":"2,331.88"},{"v":0.09,"d":"9.00%"},{"v":4663.75,"d":"4,663.75"},{"v":0.11,"d":"11.00%"},{"v":4663.75,"d":"4,663.75"},{"v":0.11,"d":"11.00%"},{"v":4663.75,"d":"4,663.75"},{"v":0.11,"d":"11.00%"},513.01]
["2015-10-01",{"v":1399.12,"d":"1,399.12"},{"v":0.08,"d":"8.00%"},{"v":2331.88,"d":"2,331.88"},{"v":0.09,"d":"9.00%"},{"v":4663.75,"d":"4,663.75"},{"v":0.11,"d":"11.00%"},{"v":4663.75,"d":"4,663.75"},{"v":0.11,"d":"11.00%"},{"v":4663.75,"d":"4,663.75"},{"v":0.11,"d":"11.00%"},513.01]
["2015-11-01",{"v":1399.12,"d":"1,399.12"},{"v":0.08,"d":"8.00%"},{"v":2331.88,"d":"2,331.88"},{"v":0.09,"d":"9.00%"},{"v":4663.75,"d":"4,663.75"},{"v":0.11,"d":"11.00%"},{"v":4663.75,"d":"4,663.75"},{"v":0.11,"d":"11.00%"},{"v":4663.75,"d":"4,663.75"},{"v":0.11,"d":"11.00%"},513.01]
["2015-12-01",{"v":1399.12,"d":"1,399.12"},{"v":0.08,"d":"8.00%"},{"v":2331.88,"d":"2,331.88"},{"v":0.09,"d":"9.00%"},{"v":4663.75,"d":"4,663.75"},{"v":0.11,"d":"11.00%"},{"v":4663.75,"d":"4,663.75"},{"v":0.11,"d":"11.00%"},{"v":4663.75,"d":"4,663.75"},{"v":0.11,"d":"11.00%"},513.01]
["2016-01-01",{"v":1556.94,"d":"1,556.94"},{"v":0.08,"d":"8.00%"},{"v":2594.92,"d":"2,594.92"},{"v":0.09,"d":"9.00%"},{"v":5189.82,"d":"5,189.82"},{"v":0.11,"d":"11.00%"},{"v":5189.82,"d":"5,189.82"},{"v":0.11,"d":"11.00%"},{"v":5189.82,"d":"5,189.82"},{"v":0.11,"d":"11.00%"},570.88]
["2016-02-01",{"v":1556.94,"d":"1,556.94"},{"v":0.08,"d":"8.00%"},{"v":2594.92,"d":"2,594.92"},{"v":0.09,"d":"9.00%"},{"v":5189.82,"d":"5,189.82"},{"v":0.11,"d":"11.00%"},{"v":5189.82,"d":"5,189.82"},{"v":0.11,"d":"11.00%"},{"v":5189.82,"d":"5,189.82"},{"v":0.11,"d":"11.00%"},570.88]
["2016-03-01",{"v":1556.94,"d":"1,556.94"},{"v":0.08,"d":"8.00%"},{"v":2594.92,"d":"2,594.92"},{"v":0.09,"d":"9.00%"},{"v":5189.82,"d":"5,189.82"},{"v":0.11,"d":"11.00%"},{"v":5189.82,"d":"5,189.82"},{"v":0.11,"d":"11.00%"},{"v":5189.82,"d":"5,189.82"},{"v":0.11,"d":"11.00%"},570.88]
["2016-04-01",{"v":1556.94,"d":"1,556.94"},{"v":0.08,"d":"8.00%"},{"v":2594.92,"d":"2,594.92"},{"v":0.09,"d":"9.00%"},{"v":5189.82,"d":"5,189.82"},{"v":0.11,"d":"11.00%"},{"v":5189.82,"d":"5,189.82"},{"v":0.11,"d":"11.00%"},{"v":5189.82,"d":"5,189.82"},{"v":0.11,"d":"11.00%"},570.88]
["2016-05-01",{"v":1556.94,"d":"1,556.94"},{"v":0.08,"d":"8.00%"},{"v":2594.92,"d":"2,594.92"},{"v":0.09,"d":"9.00%"},{"v":5189.82,"d":"5,189.82"},{"v":0.11,"d":"11.00%"},{"v":5189.82,"d":"5,189.82"},{"v":0.11,"d":"11.00%"},{"v":5189.82,"d":"5,189.82"},{"v":0.11,"d":"11.00%"},570.88]
["2016-06-01",{"v":1556.94,"d":"1,556.94"},{"v":0.08,"d":"8.00%"},{"v":2594.92,"d":"2,594.92"},{"v":0.09,"d":"9.00%"},{"v":5189.82,"d":"5,189.82"},{"v":0.11,"d":"11.00%"},{"v":5189.82,"d":"5,189.82"},{"v":0.11,"d":"11.00%"},{"v":5189.82,"d":"5,189.82"},{"v":0.11,"d":"11.00%"},570.88]
["2016-07-01",{"v":1556.94,"d":"1,556.94"},{"v":0.08,"d":"8.00%"},{"v":2594.92,"d":"2,594.92"},{"v":0.09,"d":"9.00%"},{"v":5189.82,"d":"5,189.82"},{"v":0.11,"d":"11.00%"},{"v":5189.82,"d":"5,189.82"},{"v":0.11,"d":"11.00%"},{"v":5189.82,"d":"5,189.82"},{"v":0.11,"d":"11.00%"},570.88]
["2016-08-01",{"v":1556.94,"d":"1,556.94"},{"v":0.08,"d":"8.00%"},{"v":2594.92,"d":"2,594.92"},{"v":0.09,"d":"9.00%"},{"v":5189.82,"d":"5,189.82"},{"v":0.11,"d":"11.00%"},{"v":5189.82,"d":"5,189.82"},{"v":0.11,"d":"11.00%"},{"v":5189.82,"d":"5,189.82"},{"v":0.11,"d":"11.00%"},570.88]
["2016-09-01",{"v":1556.94,"d":"1,556.94"},{"v":0.08,"d":"8.00%"},{"v":2594.92,"d":"2,594.92"},{"v":0.09,"d":"9.00%"},{"v":5189.82,"d":"5,189.82"},{"v":0.11,"d":"11.00%"},{"v":5189.82,"d":"5,189.82"},{"v":0.11,"d":"11.00%"},{"v":5189.82,"d":"5,189.82"},{"v":0.11,"d":"11.00%"},570.88]
["2016-10-01",{"v":1556.94,"d":"1,556.94"},{"v":0.08,"d":"8.00%"},{"v":2594.92,"d":"2,594.92"},{"v":0.09,"d":"9.00%"},{"v":5189.82,"d":"5,189.82"},{"v":0.11,"d":"11.00%"},{"v":5189.82,"d":"5,189.82"},{"v":0.11,"d":"11.00%"},{"v":5189.82,"d":"5,189.82"},{"v":0.11,"d":"11.00%"},570.88]
["2016-11-01",{"v":1556.94,"d":"1,556.94"},{"v":0.08,"d":"8.00%"},{"v":2594.92,"d":"2,594.92"},{"v":0.09,"d":"9.00%"},{"v":5189.82,"d":"5,189.82"},{"v":0.11,"d":"11.00%"},{"v":5189.82,"d":"5,189.82"},{"v":0.11,"d":"11.00%"},{"v":5189.82,"d":"5,189.82"},{"v":0.11,"d":"11.00%"},570.88]
["2016-12-01",{"v":1556.94,"d":"1,556.94"},{"v":0.08,"d":"8.00%"},{"v":2594.92,"d":"2,594.92"},{"v":0.09,"d":"9.00%"},{"v":5189.82,"d":"5,189.82"},{"v":0.11,"d":"11.00%"},{"v":5189.82,"d":"5,189.82"},{"v":0.11,"d":"11.00%"},{"v":5189.82,"d":"5,189.82"},{"v":0.11,"d":"11.00%"},570.88]
["2017-01-01",{"v":1659.38,"d":"1,659.38"},{"v":0.08,"d":"8.00%"},{"v":2765.66,"d":"2,765.66"},{"v":0.09,"d":"9.00%"},{"v":5531.31,"d":"5,531.31"},{"v":0.11,"d":"11.00%"},{"v":5531.31,"d":"5,531.31"},{"v":0.11,"d":"11.00%"},{"v":5531.31,"d":"5,531.31"},{"v":0.11,"d":"11.00%"},608.44]
["2017-02-01",{"v":1659.38,"d":"1,659.38"},{"v":0.08,"d":"8.00%"},{"v":2765.66,"d":"2,765.66"},{"v":0.09,"d":"9.00%"},{"v":5531.31,"d":"5,531.31"},{"v":0.11,"d":"11.00%"},{"v":5531.31,"d":"5,531.31"},{"v":0.11,"d":"11.00%"},{"v":5531.31,"d":"5,531.31"},{"v":0.11,"d":"11.00%"},608.44]
["2017-03-01",{"v":1659.38,"d":"1,659.38"},{"v":0.08,"d":"8.00%"},{"v":2765.66,"d":"2,765.66"},{"v":0.09,"d":"9.00%"},{"v":5531.31,"d":"5,531.31"},{"v":0.11,"d":"11.00%"},{"v":5531.31,"d":"5,531.31"},{"v":0.11,"d":"11.00%"},{"v":5531.31,"d":"5,531.31"},{"v":0.11,"d":"11.00%"},608.44]
["2017-04-01",{"v":1659.38,"d":"1,659.38"},{"v":0.08,"d":"8.00%"},{"v":2765.66,"d":"2,765.66"},{"v":0.09,"d":"9.00%"},{"v":5531.31,"d":"5,531.31"},{"v":0.11,"d":"11.00%"},{"v":5531.31,"d":"5,531.31"},{"v":0.11,"d":"11.00%"},{"v":5531.31,"d":"5,531.31"},{"v":0.11,"d":"11.00%"},608.44]
["2017-05-01",{"v":1659.38,"d":"1,659.38"},{"v":0.08,"d":"8.00%"},{"v":2765.66,"d":"2,765.66"},{"v":0.09,"d":"9.00%"},{"v":5531.31,"d":"5,531.31"},{"v":0.11,"d":"11.00%"},{"v":5531.31,"d":"5,531.31"},{"v":0.11,"d":"11.00%"},{"v":5531.31,"d":"5,531.31"},{"v":0.11,"d":"11.00%"},608.44]
["2017-06-01",{"v":1659.38,"d":"1,659.38"},{"v":0.08,"d":"8.00%"},{"v":2765.66,"d":"2,765.66"},{"v":0.09,"d":"9.00%"},{"v":5531.31,"d":"5,531.31"},{"v":0.11,"d":"11.00%"},{"v":5531.31,"d":"5,531.31"},{"v":0.11,"d":"11.00%"},{"v":5531.31,"d":"5,531.31"},{"v":0.11,"d":"11.00%"},608.44]
["2017-07-01",{"v":1659.38,"d":"1,659.38"},{"v":0.08,"d":"8.00%"},{"v":2765.66,"d":"2,765.66"},{"v":0.09,"d":"9.00%"},{"v":5531.31,"d":"5,531.31"},{"v":0.11,"d":"11.00%"},{"v":5531.31,"d":"5,531.31"},{"v":0.11,"d":"11.00%"},{"v":5531.31,"d":"5,531.31"},{"v":0.11,"d":"11.00%"},608.44]
["2017-08-01",{"v":1659.38,"d":"1,659.38"},{"v":0.08,"d":"8.00%"},{"v":2765.66,"d":"2,765.66"},{"v":0.09,"d":"9.00%"},{"v":5531.31,"d":"5,531.31"},{"v":0.11,"d":"11.00%"},{"v":5531.31,"d":"5,531.31"},{"v":0.11,"d":"11.00%"},{"v":5531.31,"d":"5,531.31"},{"v":0.11,"d":"11.00%"},608.44]
["2017-09-01",{"v":1659.38,"d":"1,659.38"},{"v":0.08,"d":"8.00%"},{"v":2765.66,"d":"2,765.66"},{"v":0.09,"d":"9.00%"},{"v":5531.31,"d":"5,531.31"},{"v":0.11,"d":"11.00%"},{"v":5531.31,"d":"5,531.31"},{"v":0.11,"d":"11.00%"},{"v":5531.31,"d":"5,531.31"},{"v":0.11,"d":"11.00%"},608.44]
["2017-10-01",{"v":1659.38,"d":"1,659.38"},{"v":0.08,"d":"8.00%"},{"v":2765.66,"d":"2,765.66"},{"v":0.09,"d":"9.00%"},{"v":5531.31,"d":"5,531.31"},{"v":0.11,"d":"11.00%"},{"v":5531.31,"d":"5,531.31"},{"v":0.11,"d":"11.00%"},{"v":5531.31,"d":"5,531.31"},{"v":0.11,"d":"11.00%"},608.44]
["2017-11-01",{"v":1659.38,"d":"1,659.38"},{"v":0.08,"d":"8.00%"},{"v":2765.66,"d":"2,765.66"},{"v":0.09,"d":"9.00%"},{"v":5531.31,"d":"5,531.31"},{"v":0.11,"d":"11.00%"},{"v":5531.31,"d":"5,531.31"},{"v":0.11,"d":"11.00%"},{"v":5531.31,"d":"5,531.31"},{"v":0.11,"d":"11.00%"},608.44]
["2017-12-01",{"v":1659.38,"d":"1,659.38"},{"v":0.08,"d":"8.00%"},{"v":2765.66,"d":"2,765.66"},{"v":0.09,"d":"9.00%"},{"v":5531.31,"d":"5,531.31"},{"v":0.11,"d":"11.00%"},{"v":5531.31,"d":"5,531.31"},{"v":0.11,"d":"11.00%"},{"v":5531.31,"d":"5,531.31"},{"v":0.11,"d":"11.00%"},608.44]
["2018-01-01",{"v":1693.72,"d":"1,693.72"},{"v":0.08,"d":"8.00%"},{"v":2822.9,"d":"2,822.90"},{"v":0.09,"d":"9.00%"},{"v":5645.8,"d":"5,645.80"},{"v":0.11,"d":"11.00%"},{"v":5645.8,"d":"5,645.80"},{"v":0.11,"d":"11.00%"},{"v":5645.8,"d":"5,645.80"},{"v":0.11,"d":"11.00%"},621.04]
["2018-02-01",{"v":1693.72,"d":"1,693.72"},{"v":0.08,"d":"8.00%"},{"v":2822.9,"d":"2,822.90"},{"v":0.09,"d":"9.00%"},{"v":5645.8,"d":"5,645.80"},{"v":0.11,"d":"11.00%"},{"v":5645.8,"d":"5,645.80"},{"v":0.11,"d":"11.00%"},{"v":5645.8,"d":"5,645.80"},{"v":0.11,"d":"11.00%"},621.04]
["2018-03-01",{"v":1693.72,"d":"1,693.72"},{"v":0.08,"d":"8.00%"},{"v":2822.9,"d":"2,822.90"},{"v":0.09,"d":"9.00%"},{"v":5645.8,"d":"5,645.80"},{"v":0.11,"d":"11.00%"},{"v":5645.8,"d":"5,645.80"},{"v":0.11,"d":"11.00%"},{"v":5645.8,"d":"5,645.80"},{"v":0.11,"d":"11.00%"},621.04]
["2018-04-01",{"v":1693.72,"d":"1,693.72"},{"v":0.08,"d":"8.00%"},{"v":2822.9,"d":"2,822.90"},{"v":0.09,"d":"9.00%"},{"v":5645.8,"d":"5,645.80"},{"v":0.11,"d":"11.00%"},{"v":5645.8,"d":"5,645.80"},{"v":0.11,"d":"11.00%"},{"v":5645.8,"d":"5,645.80"},{"v":0.11,"d":"11.00%"},621.04]
["2018-05-01",{"v":1693.72,"d":"1,693.72"},{"v":0.08,"d":"8.00%"},{"v":2822.9,"d":"2,822.90"},{"v":0.09,"d":"9.00%"},{"v":5645.8,"d":"5,645.80"},{"v":0.11,"d":"11.00%"},{"v":5645.8,"d":"5,645.80"},{"v":0.11,"d":"11.00%"},{"v":5645.8,"d":"5,645.80"},{"v":0.11,"d":"11.00%"},621.04]
["2018-06-01",{"v":1693.72,"d":"1,693.72"},{"v":0.08,"d":"8.00%"},{"v":2822.9,"d":"2,822.90"},{"v":0.09,"d":"9.00%"},{"v":5645.8,"d":"5,645.80"},{"v":0.11,"d":"11.00%"},{"v":5645.8,"d":"5,645.80"},{"v":0.11,"d":"11.00%"},{"v":5645.8,"d":"5,645.80"},{"v":0.11,"d":"11.00%"},621.04]
["2018-07-01",{"v":1693.72,"d":"1,693.72"},{"v":0.08,"d":"8.00%"},{"v":2822.9,"d":"2,822.90"},{"v":0.09,"d":"9.00%"},{"v":5645.8,"d":"5,645.80"},{"v":0.11,"d":"11.00%"},{"v":5645.8,"d":"5,645.80"},{"v":0.11,"d":"11.00%"},{"v":5645.8,"d":"5,645.80"},{"v":0.11,"d":"11.00%"},621.04]
["2018-08-01",{"v":1693.72,"d":"1,693.72"},{"v":0.08,"d":"8.00%"},{"v":2822.9,"d":"2,822.90"},{"v":0.09,"d":"9.00%"},{"v":5645.8,"d":"5,645.80"},{"v":0.11,"d":"11.00%"},{"v":5645.8,"d":"5,645.80"},{"v":0.11,"d":"11.00%"},{"v":5645.8,"d":"5,645.80"},{"v":0.11,"d":"11.00%"},621.04]
["2018-09-01",{"v":1693.72,"d":"1,693.72"},{"v":0.08,"d":"8.00%"},{"v":2822.9,"d":"2,822.90"},{"v":0.09,"d":"9.00%"},{"v":5645.8,"d":"5,645.80"},{"v":0.11,"d":"11.00%"},{"v":5645.8,"d":"5,645.80"},{"v":0.11,"d":"11.00%"},{"v":5645.8,"d":"5,645.80"},{"v":0.11,"d":"11.00%"},621.04]
["2018-10-01",{"v":1693.72,"d":"1,693.72"},{"v":0.08,"d":"8.00%"},{"v":2822.9,"d":"2,822.90"},{"v":0.09,"d":"9.00%"},{"v":5645.8,"d":"5,645.80"},{"v":0.11,"d":"11.00%"},{"v":5645.8,"d":"5,645.80"},{"v":0.11,"d":"11.00%"},{"v":5645.8,"d":"5,645.80"},{"v":0.11,"d":"11.00%"},621.04]
["2018-11-01",{"v":1693.72,"d":"1,693.72"},{"v":0.08,"d":"8.00%"},{"v":2822.9,"d":"2,822.90"},{"v":0.09,"d":"9.00%"},{"v":5645.8,"d":"5,645.80"},{"v":0.11,"d":"11.00%"},{"v":5645.8,"d":"5,645.80"},{"v":0.11,"d":"11.00%"},{"v":5645.8,"d":"5,645.80"},{"v":0.11,"d":"11.00%"},621.04]
["2018-12-01",{"v":1693.72,"d":"1,693.72"},{"v":0.08,"d":"8.00%"},{"v":2822.9,"d":"2,822.90"},{"v":0.09,"d":"9.00%"},{"v":5645.8,"d":"5,645.80"},{"v":0.11,"d":"11.00%"},{"v":5645.8,"d":"5,645.80"},{"v":0.11,"d":"11.00%"},{"v":5645.8,"d":"5,645.80"},{"v":0.11,"d":"11.00%"},621.04]
["2019-01-01",{"v":1751.81,"d":"1,751.81"},{"v":0.08,"d":"8.00%"},{"v":2919.72,"d":"2,919.72"},{"v":0.09,"d":"9.00%"},{"v":5839.45,"d":"5,839.45"},{"v":0.11,"d":"11.00%"},{"v":5839.45,"d":"5,839.45"},{"v":0.11,"d":"11.00%"},{"v":5839.45,"d":"5,839.45"},{"v":0.11,"d":"11.00%"},642.34]
["2019-02-01",{"v":1751.81,"d":"1,751.81"},{"v":0.08,"d":"8.00%"},{"v":2919.72,"d":"2,919.72"},{"v":0.09,"d":"9.00%"},{"v":5839.45,"d":"5,839.45"},{"v":0.11,"d":"11.00%"},{"v":5839.45,"d":"5,839.45"},{"v":0.11,"d":"11.00%"},{"v":5839.45,"d":"5,839.45"},{"v":0.11,"d":"11.00%"},642.34]
["2019-03-01",{"v":1751.81,"d":"1,751.81"},{"v":0.08,"d":"8.00%"},{"v":2919.72,"d":"2,919.72"},{"v":0.09,"d":"9.00%"},{"v":5839.45,"d":"5,839.45"},{"v":0.11,"d":"11.00%"},{"v":5839.45,"d":"5,839.45"},{"v":0.11,"d":"11.00%"},{"v":5839.45,"d":"5,839.45"},{"v":0.11,"d":"11.00%"},642.34]
["2019-04-01",{"v":1751.81,"d":"1,751.81"},{"v":0.08,"d":"8.00%"},{"v":2919.72,"d":"2,919.72"},{"v":0.09,"d":"9.00%"},{"v":5839.45,"d":"5,839.45"},{"v":0.11,"d":"11.00%"},{"v":5839.45,"d":"5,839.45"},{"v":0.11,"d":"11.00%"},{"v":5839.45,"d":"5,839.45"},{"v":0.11,"d":"11.00%"},642.34]
["2019-05-01",{"v":1751.81,"d":"1,751.81"},{"v":0.08,"d":"8.00%"},{"v":2919.72,"d":"2,919.72"},{"v":0.09,"d":"9.00%"},{"v":5839.45,"d":"5,839.45"},{"v":0.11,"d":"11.00%"},{"v":5839.45,"d":"5,839.45"},{"v":0.11,"d":"11.00%"},{"v":5839.45,"d":"5,839.45"},{"v":0.11,"d":"11.00%"},642.34]
["2019-06-01",{"v":1751.81,"d":"1,751.81"},{"v":0.08,"d":"8.00%"},{"v":2919.72,"d":"2,919.72"},{"v":0.09,"d":"9.00%"},{"v":5839.45,"d":"5,839.45"},{"v":0.11,"d":"11.00%"},{"v":5839.45,"d":"5,839.45"},{"v":0.11,"d":"11.00%"},{"v":5839.45,"d":"5,839.45"},{"v":0.11,"d":"11.00%"},642.34]
["2019-07-01",{"v":1751.81,"d":"1,751.81"},{"v":0.08,"d":"8.00%"},{"v":2919.72,"d":"2,919.72"},{"v":0.09,"d":"9.00%"},{"v":5839.45,"d":"5,839.45"},{"v":0.11,"d":"11.00%"},{"v":5839.45,"d":"5,839.45"},{"v":0.11,"d":"11.00%"},{"v":5839.45,"d":"5,839.45"},{"v":0.11,"d":"11.00%"},642.34]
["2019-08-01",{"v":1751.81,"d":"1,751.81"},{"v":0.08,"d":"8.00%"},{"v":2919.72,"d":"2,919.72"},{"v":0.09,"d":"9.00%"},{"v":5839.45,"d":"5,839.45"},{"v":0.11,"d":"11.00%"},{"v":5839.45,"d":"5,839.45"},{"v":0.11,"d":"11.00%"},{"v":5839.45,"d":"5,839.45"},{"v":0.11,"d":"11.00%"},642.34]
["2019-09-01",{"v":1751.81,"d":"1,751.81"},{"v":0.08,"d":"8.00%"},{"v":2919.72,"d":"2,919.72"},{"v":0.09,"d":"9.00%"},{"v":5839.45,"d":"5,839.45"},{"v":0.11,"d":"11.00%"},{"v":5839.45,"d":"5,839.45"},{"v":0.11,"d":"11.00%"},{"v":5839.45,"d":"5,839.45"},{"v":0.11,"d":"11.00%"},642.34]
["2019-10-01",{"v":1751.81,"d":"1,751.81"},{"v":0.08,"d":"8.00%"},{"v":2919.72,"d":"2,919.72"},{"v":0.09,"d":"9.00%"},{"v":5839.45,"d":"5,839.45"},{"v":0.11,"d":"11.00%"},{"v":5839.45,"d":"5,839.45"},{"v":0.11,"d":"11.00%"},{"v":5839.45,"d":"5,839.45"},{"v":0.11,"d":"11.00%"},642.34]
["2019-11-01",{"v":1751.81,"d":"1,751.81"},{"v":0.08,"d":"8.00%"},{"v":2919.72,"d":"2,919.72"},{"v":0.09,"d":"9.00%"},{"v":5839.45,"d":"5,839.45"},{"v":0.11,"d":"11.00%"},{"v":5839.45,"d":"5,839.45"},{"v":0.11,"d":"11.00%"},{"v":5839.45,"d":"5,839.45"},{"v":0.11,"d":"11.00%"},642.34]
["2019-12-01",{"v":1751.81,"d":"1,751.81"},{"v":0.08,"d":"8.00%"},{"v":2919.72,"d":"2,919.72"},{"v":0.09,"d":"9.00%"},{"v":5839.45,"d":"5,839.45"},{"v":0.11,"d":"11.00%"},{"v":5839.45,"d":"5,839.45"},{"v":0.11,"d":"11.00%"},{"v":5839.45,"d":"5,839.45"},{"v":0.11,"d":"11.00%"},642.34]
["2020-01-01",{"v":1830.29,"d":"1,830.29"},{"v":0.08,"d":"8.00%"},{"v":3050.52,"d":"3,050.52"},{"v":0.09,"d":"9.00%"},{"v":6101.06,"d":"6,101.06"},{"v":0.11,"d":"11.00%"},{"v":6101.06,"d":"6,101.06"},{"v":0.11,"d":"11.00%"},{"v":6101.06,"d":"6,101.06"},{"v":0.11,"d":"11.00%"},671.12]
["2020-02-01",{"v":1830.29,"d":"1,830.29"},{"v":0.08,"d":"8.00%"},{"v":3050.52,"d":"3,050.52"},{"v":0.09,"d":"9.00%"},{"v":6101.06,"d":"6,101.06"},{"v":0.11,"d":"11.00%"},{"v":6101.06,"d":"6,101.06"},{"v":0.11,"d":"11.00%"},{"v":6101.06,"d":"6,101.06"},{"v":0.11,"d":"11.00%"},671.12]
["2020-03-01",{"v":1045,"d":"1,045.00"},{"v":0.075,"d":"7.50%"},{"v":2089.6,"d":"2,089.60"},{"v":0.09,"d":"9.00%"},{"v":3134.4,"d":"3,134.40"},{"v":0.12,"d":"12.00%"},{"v":6101.06,"d":"6,101.06"},{"v":0.14,"d":"14.00%"},{"v":6101.06,"d":"6,101.06"},{"v":0.14,"d":"14.00%"},854.15,{"$f":"15.67","v":15.67},78.36,141.05]
["2020-04-01",{"v":1045,"d":"1,045.00"},{"v":0.075,"d":"7.50%"},{"v":2089.6,"d":"2,089.60"},{"v":0.09,"d":"9.00%"},{"v":3134.4,"d":"3,134.40"},{"v":0.12,"d":"12.00%"},{"v":6101.06,"d":"6,101.06"},{"v":0.14,"d":"14.00%"},{"v":6101.06,"d":"6,101.06"},{"v":0.14,"d":"14.00%"},854.15,{"$f":"15.67","v":15.67},78.36,141.05]
["2020-05-01",{"v":1045,"d":"1,045.00"},{"v":0.075,"d":"7.50%"},{"v":2089.6,"d":"2,089.60"},{"v":0.09,"d":"9.00%"},{"v":3134.4,"d":"3,134.40"},{"v":0.12,"d":"12.00%"},{"v":6101.06,"d":"6,101.06"},{"v":0.14,"d":"14.00%"},{"v":6101.06,"d":"6,101.06"},{"v":0.14,"d":"14.00%"},854.15,15.67,78.36,141.05]
["2020-06-01",{"v":1045,"d":"1,045.00"},{"v":0.075,"d":"7.50%"},{"v":2089.6,"d":"2,089.60"},{"v":0.09,"d":"9.00%"},{"v":3134.4,"d":"3,134.40"},{"v":0.12,"d":"12.00%"},{"v":6101.06,"d":"6,101.06"},{"v":0.14,"d":"14.00%"},{"v":6101.06,"d":"6,101.06"},{"v":0.14,"d":"14.00%"},854.15,15.67,78.36,141.05]
["2020-07-01",{"v":1045,"d":"1,045.00"},{"v":0.075,"d":"7.50%"},{"v":2089.6,"d":"2,089.60"},{"v":0.09,"d":"9.00%"},{"v":3134.4,"d":"3,134.40"},{"v":0.12,"d":"12.00%"},{"v":6101.06,"d":"6,101.06"},{"v":0.14,"d":"14.00%"},{"v":6101.06,"d":"6,101.06"},{"v":0.14,"d":"14.00%"},854.15,15.67,78.36,141.05]
["2020-08-01",{"v":1045,"d":"1,045.00"},{"v":0.075,"d":"7.50%"},{"v":2089.6,"d":"2,089.60"},{"v":0.09,"d":"9.00%"},{"v":3134.4,"d":"3,134.40"},{"v":0.12,"d":"12.00%"},{"v":6101.06,"d":"6,101.06"},{"v":0.14,"d":"14.00%"},{"v":6101.06,"d":"6,101.06"},{"v":0.14,"d":"14.00%"},854.15,15.67,78.36,141.05]
["2020-09-01",{"v":1045,"d":"1,045.00"},{"v":0.075,"d":"7.50%"},{"v":2089.6,"d":"2,089.60"},{"v":0.09,"d":"9.00%"},{"v":3134.4,"d":"3,134.40"},{"v":0.12,"d":"12.00%"},{"v":6101.06,"d":"6,101.06"},{"v":0.14,"d":"14.00%"},{"v":6101.06,"d":"6,101.06"},{"v":0.14,"d":"14.00%"},854.15,15.67,78.36,141.05]
["2020-10-01",{"v":1045,"d":"1,045.00"},{"v":0.075,"d":"7.50%"},{"v":2089.6,"d":"2,089.60"},{"v":0.09,"d":"9.00%"},{"v":3134.4,"d":"3,134.40"},{"v":0.12,"d":"12.00%"},{"v":6101.06,"d":"6,101.06"},{"v":0.14,"d":"14.00%"},{"v":6101.06,"d":"6,101.06"},{"v":0.14,"d":"14.00%"},854.15,15.67,78.36,141.05]
["2020-11-01",{"v":1045,"d":"1,045.00"},{"v":0.075,"d":"7.50%"},{"v":2089.6,"d":"2,089.60"},{"v":0.09,"d":"9.00%"},{"v":3134.4,"d":"3,134.40"},{"v":0.12,"d":"12.00%"},{"v":6101.06,"d":"6,101.06"},{"v":0.14,"d":"14.00%"},{"v":6101.06,"d":"6,101.06"},{"v":0.14,"d":"14.00%"},854.15,15.67,78.36,141.05]
["2020-12-01",{"v":1045,"d":"1,045.00"},{"v":0.075,"d":"7.50%"},{"v":2089.6,"d":"2,089.60"},{"v":0.09,"d":"9.00%"},{"v":3134.4,"d":"3,134.40"},{"v":0.12,"d":"12.00%"},{"v":6101.06,"d":"6,101.06"},{"v":0.14,"d":"14.00%"},{"v":6101.06,"d":"6,101.06"},{"v":0.14,"d":"14.00%"},854.15,15.67,78.36,141.05]
["2021-01-01",{"v":1100,"d":"1,100.00"},{"v":0.075,"d":"7.50%"},{"v":2203.48,"d":"2,203.48"},{"v":0.09,"d":"9.00%"},{"v":3305.22,"d":"3,305.22"},{"v":0.12,"d":"12.00%"},{"v":6433.57,"d":"6,433.57"},{"v":0.14,"d":"14.00%"},{"v":6433.57,"d":"6,433.57"},{"v":0.14,"d":"14.00%"},{"v":900.7,"d":"900.70"},{"v":16.5,"d":"16.50"},{"v":82.6,"d":"82.60"},148.71]
["2021-02-01",{"v":1100,"d":"1,100.00"},{"v":0.075,"d":"7.50%"},{"v":2203.48,"d":"2,203.48"},{"v":0.09,"d":"9.00%"},{"v":3305.22,"d":"3,305.22"},{"v":0.12,"d":"12.00%"},{"v":6433.57,"d":"6,433.57"},{"v":0.14,"d":"14.00%"},{"v":6433.57,"d":"6,433.57"},{"v":0.14,"d":"14.00%"},{"v":900.7,"d":"900.70"},{"v":16.5,"d":"16.50"},{"v":82.6,"d":"82.60"},148.71]
["2021-03-01",{"v":1100,"d":"1,100.00"},{"v":0.075,"d":"7.50%"},{"v":2203.48,"d":"2,203.48"},{"v":0.09,"d":"9.00%"},{"v":3305.22,"d":"3,305.22"},{"v":0.12,"d":"12.00%"},{"v":6433.57,"d":"6,433.57"},{"v":0.14,"d":"14.00%"},{"v":6433.57,"d":"6,433.57"},{"v":0.14,"d":"14.00%"},{"v":900.7,"d":"900.70"},{"v":16.5,"d":"16.50"},{"v":82.6,"d":"82.60"},148.71]
["2021-04-01",{"v":1100,"d":"1,100.00"},{"v":0.075,"d":"7.50%"},{"v":2203.48,"d":"2,203.48"},{"v":0.09,"d":"9.00%"},{"v":3305.22,"d":"3,305.22"},{"v":0.12,"d":"12.00%"},{"v":6433.57,"d":"6,433.57"},{"v":0.14,"d":"14.00%"},{"v":6433.57,"d":"6,433.57"},{"v":0.14,"d":"14.00%"},{"v":900.7,"d":"900.70"},{"v":16.5,"d":"16.50"},{"v":82.6,"d":"82.60"},148.71]
["2021-05-01",{"v":1100,"d":"1,100.00"},{"v":0.075,"d":"7.50%"},{"v":2203.48,"d":"2,203.48"},{"v":0.09,"d":"9.00%"},{"v":3305.22,"d":"3,305.22"},{"v":0.12,"d":"12.00%"},{"v":6433.57,"d":"6,433.57"},{"v":0.14,"d":"14.00%"},{"v":6433.57,"d":"6,433.57"},{"v":0.14,"d":"14.00%"},{"v":900.7,"d":"900.70"},{"v":16.5,"d":"16.50"},{"v":82.6,"d":"82.60"},148.71]
["2021-06-01",{"v":1100,"d":"1,100.00"},{"v":0.075,"d":"7.50%"},{"v":2203.48,"d":"2,203.48"},{"v":0.09,"d":"9.00%"},{"v":3305.22,"d":"3,305.22"},{"v":0.12,"d":"12.00%"},{"v":6433.57,"d":"6,433.57"},{"v":0.14,"d":"14.00%"},{"v":6433.57,"d":"6,433.57"},{"v":0.14,"d":"14.00%"},{"v":900.7,"d":"900.70"},{"v":16.5,"d":"16.50"},{"v":82.6,"d":"82.60"},148.71,null,null,{"$f":"J629*14%","v":{"v":992.2108000000002,"d":"992.21"}}]
["2021-07-01",{"v":1100,"d":"1,100.00"},{"v":0.075,"d":"7.50%"},{"v":2203.48,"d":"2,203.48"},{"v":0.09,"d":"9.00%"},{"v":3305.22,"d":"3,305.22"},{"v":0.12,"d":"12.00%"},{"v":6433.57,"d":"6,433.57"},{"v":0.14,"d":"14.00%"},{"v":6433.57,"d":"6,433.57"},{"v":0.14,"d":"14.00%"},{"v":900.7,"d":"900.70"},{"v":16.5,"d":"16.50"},{"v":82.6,"d":"82.60"},148.71,null,null,{"$f":"R622-O629","v":{"v":828.3908000000001,"d":"828.39"}}]
["2021-08-01",{"v":1100,"d":"1,100.00"},{"v":0.075,"d":"7.50%"},{"v":2203.48,"d":"2,203.48"},{"v":0.09,"d":"9.00%"},{"v":3305.22,"d":"3,305.22"},{"v":0.12,"d":"12.00%"},{"v":6433.57,"d":"6,433.57"},{"v":0.14,"d":"14.00%"},{"v":6433.57,"d":"6,433.57"},{"v":0.14,"d":"14.00%"},{"v":900.7,"d":"900.70"},{"v":16.5,"d":"16.50"},{"v":82.6,"d":"82.60"},148.71]
["2021-09-01",{"v":1100,"d":"1,100.00"},{"v":0.075,"d":"7.50%"},{"v":2203.48,"d":"2,203.48"},{"v":0.09,"d":"9.00%"},{"v":3305.22,"d":"3,305.22"},{"v":0.12,"d":"12.00%"},{"v":6433.57,"d":"6,433.57"},{"v":0.14,"d":"14.00%"},{"v":6433.57,"d":"6,433.57"},{"v":0.14,"d":"14.00%"},{"v":900.7,"d":"900.70"},{"v":16.5,"d":"16.50"},{"v":82.6,"d":"82.60"},148.71]
["2021-10-01",{"v":1100,"d":"1,100.00"},{"v":0.075,"d":"7.50%"},{"v":2203.48,"d":"2,203.48"},{"v":0.09,"d":"9.00%"},{"v":3305.22,"d":"3,305.22"},{"v":0.12,"d":"12.00%"},{"v":6433.57,"d":"6,433.57"},{"v":0.14,"d":"14.00%"},{"v":6433.57,"d":"6,433.57"},{"v":0.14,"d":"14.00%"},{"v":900.7,"d":"900.70"},{"v":16.5,"d":"16.50"},{"v":82.6,"d":"82.60"},148.71]
["2021-11-01",{"v":1100,"d":"1,100.00"},{"v":0.075,"d":"7.50%"},{"v":2203.48,"d":"2,203.48"},{"v":0.09,"d":"9.00%"},{"v":3305.22,"d":"3,305.22"},{"v":0.12,"d":"12.00%"},{"v":6433.57,"d":"6,433.57"},{"v":0.14,"d":"14.00%"},{"v":6433.57,"d":"6,433.57"},{"v":0.14,"d":"14.00%"},{"v":900.7,"d":"900.70"},{"v":16.5,"d":"16.50"},{"v":82.6,"d":"82.60"},148.71]
["2021-12-01",{"v":1100,"d":"1,100.00"},{"v":0.075,"d":"7.50%"},{"v":2203.48,"d":"2,203.48"},{"v":0.09,"d":"9.00%"},{"v":3305.22,"d":"3,305.22"},{"v":0.12,"d":"12.00%"},{"v":6433.57,"d":"6,433.57"},{"v":0.14,"d":"14.00%"},{"v":6433.57,"d":"6,433.57"},{"v":0.14,"d":"14.00%"},{"v":900.7,"d":"900.70"},{"v":16.5,"d":"16.50"},{"v":82.6,"d":"82.60"},148.71]
["2022-01-01",{"v":1212,"d":"1,212.00"},{"v":0.075,"d":"7.50%"},{"v":2427.35,"d":"2,427.35"},{"v":0.09,"d":"9.00%"},{"v":3641.03,"d":"3,641.03"},{"v":0.12,"d":"12.00%"},{"v":7087.22,"d":"7,087.22"},{"v":0.14,"d":"14.00%"},{"v":7087.22,"d":"7,087.22"},{"v":0.14,"d":"14.00%"},992.21,18.18,{"v":91,"d":"91.00"},163.82]
["2022-02-01",{"v":1212,"d":"1,212.00"},{"v":0.075,"d":"7.50%"},{"v":2427.35,"d":"2,427.35"},{"v":0.09,"d":"9.00%"},{"v":3641.03,"d":"3,641.03"},{"v":0.12,"d":"12.00%"},{"v":7087.22,"d":"7,087.22"},{"v":0.14,"d":"14.00%"},{"v":7087.22,"d":"7,087.22"},{"v":0.14,"d":"14.00%"},992.21,18.18,{"v":91,"d":"91.00"},163.82]
["2022-03-01",{"v":1212,"d":"1,212.00"},{"v":0.075,"d":"7.50%"},{"v":2427.35,"d":"2,427.35"},{"v":0.09,"d":"9.00%"},{"v":3641.03,"d":"3,641.03"},{"v":0.12,"d":"12.00%"},{"v":7087.22,"d":"7,087.22"},{"v":0.14,"d":"14.00%"},{"v":7087.22,"d":"7,087.22"},{"v":0.14,"d":"14.00%"},992.21,18.18,{"v":91,"d":"91.00"},163.82]
["2022-04-01",{"v":1212,"d":"1,212.00"},{"v":0.075,"d":"7.50%"},{"v":2427.35,"d":"2,427.35"},{"v":0.09,"d":"9.00%"},{"v":3641.03,"d":"3,641.03"},{"v":0.12,"d":"12.00%"},{"v":7087.22,"d":"7,087.22"},{"v":0.14,"d":"14.00%"},{"v":7087.22,"d":"7,087.22"},{"v":0.14,"d":"14.00%"},992.21,18.18,{"v":91,"d":"91.00"},163.82]
["2022-05-01",{"v":1212,"d":"1,212.00"},{"v":0.075,"d":"7.50%"},{"v":2427.35,"d":"2,427.35"},{"v":0.09,"d":"9.00%"},{"v":3641.03,"d":"3,641.03"},{"v":0.12,"d":"12.00%"},{"v":7087.22,"d":"7,087.22"},{"v":0.14,"d":"14.00%"},{"v":7087.22,"d":"7,087.22"},{"v":0.14,"d":"14.00%"},992.21,18.18,{"v":91,"d":"91.00"},163.82]
["2022-06-01",{"v":1212,"d":"1,212.00"},{"v":0.075,"d":"7.50%"},{"v":2427.35,"d":"2,427.35"},{"v":0.09,"d":"9.00%"},{"v":3641.03,"d":"3,641.03"},{"v":0.12,"d":"12.00%"},{"v":7087.22,"d":"7,087.22"},{"v":0.14,"d":"14.00%"},{"v":7087.22,"d":"7,087.22"},{"v":0.14,"d":"14.00%"},992.21,18.18,{"v":91,"d":"91.00"},163.82]
["2022-07-01",{"v":1212,"d":"1,212.00"},{"v":0.075,"d":"7.50%"},{"v":2427.35,"d":"2,427.35"},{"v":0.09,"d":"9.00%"},{"v":3641.03,"d":"3,641.03"},{"v":0.12,"d":"12.00%"},{"v":7087.22,"d":"7,087.22"},{"v":0.14,"d":"14.00%"},{"v":7087.22,"d":"7,087.22"},{"v":0.14,"d":"14.00%"},992.21,18.18,{"v":91,"d":"91.00"},163.82]
["2022-08-01",{"v":1212,"d":"1,212.00"},{"v":0.075,"d":"7.50%"},{"v":2427.35,"d":"2,427.35"},{"v":0.09,"d":"9.00%"},{"v":3641.03,"d":"3,641.03"},{"v":0.12,"d":"12.00%"},{"v":7087.22,"d":"7,087.22"},{"v":0.14,"d":"14.00%"},{"v":7087.22,"d":"7,087.22"},{"v":0.14,"d":"14.00%"},992.21,18.18,{"v":91,"d":"91.00"},163.82]
["2022-09-01",{"v":1212,"d":"1,212.00"},{"v":0.075,"d":"7.50%"},{"v":2427.35,"d":"2,427.35"},{"v":0.09,"d":"9.00%"},{"v":3641.03,"d":"3,641.03"},{"v":0.12,"d":"12.00%"},{"v":7087.22,"d":"7,087.22"},{"v":0.14,"d":"14.00%"},{"v":7087.22,"d":"7,087.22"},{"v":0.14,"d":"14.00%"},992.21,18.18,{"v":91,"d":"91.00"},163.82]
["2022-10-01",{"v":1212,"d":"1,212.00"},{"v":0.075,"d":"7.50%"},{"v":2427.35,"d":"2,427.35"},{"v":0.09,"d":"9.00%"},{"v":3641.03,"d":"3,641.03"},{"v":0.12,"d":"12.00%"},{"v":7087.22,"d":"7,087.22"},{"v":0.14,"d":"14.00%"},{"v":7087.22,"d":"7,087.22"},{"v":0.14,"d":"14.00%"},992.21,18.18,{"v":91,"d":"91.00"},163.82]
["2022-11-01",{"v":1212,"d":"1,212.00"},{"v":0.075,"d":"7.50%"},{"v":2427.35,"d":"2,427.35"},{"v":0.09,"d":"9.00%"},{"v":3641.03,"d":"3,641.03"},{"v":0.12,"d":"12.00%"},{"v":7087.22,"d":"7,087.22"},{"v":0.14,"d":"14.00%"},{"v":7087.22,"d":"7,087.22"},{"v":0.14,"d":"14.00%"},992.21,18.18,{"v":91,"d":"91.00"},163.82]
["2022-12-01",{"v":1212,"d":"1,212.00"},{"v":0.075,"d":"7.50%"},{"v":2427.35,"d":"2,427.35"},{"v":0.09,"d":"9.00%"},{"v":3641.03,"d":"3,641.03"},{"v":0.12,"d":"12.00%"},{"v":7087.22,"d":"7,087.22"},{"v":0.14,"d":"14.00%"},{"v":7087.22,"d":"7,087.22"},{"v":0.14,"d":"14.00%"},992.21,18.18,{"v":91,"d":"91.00"},163.82]
["2023-01-01",{"v":1302,"d":"1,302.00"},{"v":0.075,"d":"7.50%"},{"v":2571.29,"d":"2,571.29"},{"v":0.09,"d":"9.00%"},{"v":3856.94,"d":"3,856.94"},{"v":0.12,"d":"12.00%"},{"v":7507.49,"d":"7,507.49"},{"v":0.14,"d":"14.00%"},{"v":7507.49,"d":"7,507.49"},{"v":0.14,"d":"14.00%"},1051.05,19.53,96.67,173.81]
["2023-02-01",{"v":1302,"d":"1,302.00"},{"v":0.075,"d":"7.50%"},{"v":2571.29,"d":"2,571.29"},{"v":0.09,"d":"9.00%"},{"v":3856.94,"d":"3,856.94"},{"v":0.12,"d":"12.00%"},{"v":7507.49,"d":"7,507.49"},{"v":0.14,"d":"14.00%"},{"v":7507.49,"d":"7,507.49"},{"v":0.14,"d":"14.00%"},1051.05,19.53,96.67,173.81]
["2023-03-01",{"v":1302,"d":"1,302.00"},{"v":0.075,"d":"7.50%"},{"v":2571.29,"d":"2,571.29"},{"v":0.09,"d":"9.00%"},{"v":3856.94,"d":"3,856.94"},{"v":0.12,"d":"12.00%"},{"v":7507.49,"d":"7,507.49"},{"v":0.14,"d":"14.00%"},{"v":7507.49,"d":"7,507.49"},{"v":0.14,"d":"14.00%"},1051.05,19.53,96.67,173.81]
["2023-04-01",{"v":1302,"d":"1,302.00"},{"v":0.075,"d":"7.50%"},{"v":2571.29,"d":"2,571.29"},{"v":0.09,"d":"9.00%"},{"v":3856.94,"d":"3,856.94"},{"v":0.12,"d":"12.00%"},{"v":7507.49,"d":"7,507.49"},{"v":0.14,"d":"14.00%"},{"v":7507.49,"d":"7,507.49"},{"v":0.14,"d":"14.00%"},1051.05,19.53,96.67,173.81]
["2023-05-01",{"v":1320,"d":"1,320.00"},{"v":0.075,"d":"7.50%"},{"v":2571.29,"d":"2,571.29"},{"v":0.09,"d":"9.00%"},{"v":3856.94,"d":"3,856.94"},{"v":0.12,"d":"12.00%"},{"v":7507.49,"d":"7,507.49"},{"v":0.14,"d":"14.00%"},{"v":7507.49,"d":"7,507.49"},{"v":0.14,"d":"14.00%"},1051.05,{"v":19.8,"d":"19.80"},96.94,174.08]
["2023-06-01",{"v":1320,"d":"1,320.00"},{"v":0.075,"d":"7.50%"},{"v":2571.29,"d":"2,571.29"},{"v":0.09,"d":"9.00%"},{"v":3856.94,"d":"3,856.94"},{"v":0.12,"d":"12.00%"},{"v":7507.49,"d":"7,507.49"},{"v":0.14,"d":"14.00%"},{"v":7507.49,"d":"7,507.49"},{"v":0.14,"d":"14.00%"},1051.05,{"v":19.8,"d":"19.80"},96.94,174.08]
["2023-07-01",{"v":1320,"d":"1,320.00"},{"v":0.075,"d":"7.50%"},{"v":2571.29,"d":"2,571.29"},{"v":0.09,"d":"9.00%"},{"v":3856.94,"d":"3,856.94"},{"v":0.12,"d":"12.00%"},{"v":7507.49,"d":"7,507.49"},{"v":0.14,"d":"14.00%"},{"v":7507.49,"d":"7,507.49"},{"v":0.14,"d":"14.00%"},1051.05,{"v":19.8,"d":"19.80"},96.94,174.08]
["2023-08-01",{"v":1320,"d":"1,320.00"},{"v":0.075,"d":"7.50%"},{"v":2571.29,"d":"2,571.29"},{"v":0.09,"d":"9.00%"},{"v":3856.94,"d":"3,856.94"},{"v":0.12,"d":"12.00%"},{"v":7507.49,"d":"7,507.49"},{"v":0.14,"d":"14.00%"},{"v":7507.49,"d":"7,507.49"},{"v":0.14,"d":"14.00%"},1051.05,{"v":19.8,"d":"19.80"},96.94,174.08]
["2023-09-01",{"v":1320,"d":"1,320.00"},{"v":0.075,"d":"7.50%"},{"v":2571.29,"d":"2,571.29"},{"v":0.09,"d":"9.00%"},{"v":3856.94,"d":"3,856.94"},{"v":0.12,"d":"12.00%"},{"v":7507.49,"d":"7,507.49"},{"v":0.14,"d":"14.00%"},{"v":7507.49,"d":"7,507.49"},{"v":0.14,"d":"14.00%"},1051.05,{"v":19.8,"d":"19.80"},96.94,174.08]
["2023-10-01",{"v":1320,"d":"1,320.00"},{"v":0.075,"d":"7.50%"},{"v":2571.29,"d":"2,571.29"},{"v":0.09,"d":"9.00%"},{"v":3856.94,"d":"3,856.94"},{"v":0.12,"d":"12.00%"},{"v":7507.49,"d":"7,507.49"},{"v":0.14,"d":"14.00%"},{"v":7507.49,"d":"7,507.49"},{"v":0.14,"d":"14.00%"},1051.05,{"v":19.8,"d":"19.80"},96.94,174.08]
["2023-11-01",{"v":1320,"d":"1,320.00"},{"v":0.075,"d":"7.50%"},{"v":2571.29,"d":"2,571.29"},{"v":0.09,"d":"9.00%"},{"v":3856.94,"d":"3,856.94"},{"v":0.12,"d":"12.00%"},{"v":7507.49,"d":"7,507.49"},{"v":0.14,"d":"14.00%"},{"v":7507.49,"d":"7,507.49"},{"v":0.14,"d":"14.00%"},1051.05,{"v":19.8,"d":"19.80"},96.94,174.08]
["2023-12-01",{"v":1320,"d":"1,320.00"},{"v":0.075,"d":"7.50%"},{"v":2571.29,"d":"2,571.29"},{"v":0.09,"d":"9.00%"},{"v":3856.94,"d":"3,856.94"},{"v":0.12,"d":"12.00%"},{"v":7507.49,"d":"7,507.49"},{"v":0.14,"d":"14.00%"},{"v":7507.49,"d":"7,507.49"},{"v":0.14,"d":"14.00%"},1051.05,{"v":19.8,"d":"19.80"},96.94,174.08]
["2024-01-01",{"v":1412,"d":"1,412.00"},{"v":0.075,"d":"7.50%"},{"v":2666.68,"d":"2,666.68"},{"v":0.09,"d":"9.00%"},{"v":4000.03,"d":"4,000.03"},{"v":0.12,"d":"12.00%"},{"v":7786.02,"d":"7,786.02"},{"v":0.14,"d":"14.00%"},{"v":7786.02,"d":"7,786.02"},{"v":0.14,"d":"14.00%"},1090.04,21.18,101.18,181.18]
["2024-02-01",{"v":1412,"d":"1,412.00"},{"v":0.075,"d":"7.50%"},{"v":2666.68,"d":"2,666.68"},{"v":0.09,"d":"9.00%"},{"v":4000.03,"d":"4,000.03"},{"v":0.12,"d":"12.00%"},{"v":7786.02,"d":"7,786.02"},{"v":0.14,"d":"14.00%"},{"v":7786.02,"d":"7,786.02"},{"v":0.14,"d":"14.00%"},1090.04,21.18,101.18,181.18]
["2024-03-01",{"v":1412,"d":"1,412.00"},{"v":0.075,"d":"7.50%"},{"v":2666.68,"d":"2,666.68"},{"v":0.09,"d":"9.00%"},{"v":4000.03,"d":"4,000.03"},{"v":0.12,"d":"12.00%"},{"v":7786.02,"d":"7,786.02"},{"v":0.14,"d":"14.00%"},{"v":7786.02,"d":"7,786.02"},{"v":0.14,"d":"14.00%"},1090.04,21.18,101.18,181.18]
["2024-04-01",{"v":1412,"d":"1,412.00"},{"v":0.075,"d":"7.50%"},{"v":2666.68,"d":"2,666.68"},{"v":0.09,"d":"9.00%"},{"v":4000.03,"d":"4,000.03"},{"v":0.12,"d":"12.00%"},{"v":7786.02,"d":"7,786.02"},{"v":0.14,"d":"14.00%"},{"v":7786.02,"d":"7,786.02"},{"v":0.14,"d":"14.00%"},1090.04,21.18,101.18,181.18]
["2024-05-01",{"v":1412,"d":"1,412.00"},{"v":0.075,"d":"7.50%"},{"v":2666.68,"d":"2,666.68"},{"v":0.09,"d":"9.00%"},{"v":4000.03,"d":"4,000.03"},{"v":0.12,"d":"12.00%"},{"v":7786.02,"d":"7,786.02"},{"v":0.14,"d":"14.00%"},{"v":7786.02,"d":"7,786.02"},{"v":0.14,"d":"14.00%"},1090.04,21.18,101.18,181.18]
["2024-06-01",{"v":1412,"d":"1,412.00"},{"v":0.075,"d":"7.50%"},{"v":2666.68,"d":"2,666.68"},{"v":0.09,"d":"9.00%"},{"v":4000.03,"d":"4,000.03"},{"v":0.12,"d":"12.00%"},{"v":7786.02,"d":"7,786.02"},{"v":0.14,"d":"14.00%"},{"v":7786.02,"d":"7,786.02"},{"v":0.14,"d":"14.00%"},1090.04,21.18,101.18,181.18]
["2024-07-01",{"v":1412,"d":"1,412.00"},{"v":0.075,"d":"7.50%"},{"v":2666.68,"d":"2,666.68"},{"v":0.09,"d":"9.00%"},{"v":4000.03,"d":"4,000.03"},{"v":0.12,"d":"12.00%"},{"v":7786.02,"d":"7,786.02"},{"v":0.14,"d":"14.00%"},{"v":7786.02,"d":"7,786.02"},{"v":0.14,"d":"14.00%"},1090.04,21.18,101.18,181.18]
["2024-08-01",{"v":1412,"d":"1,412.00"},{"v":0.075,"d":"7.50%"},{"v":2666.68,"d":"2,666.68"},{"v":0.09,"d":"9.00%"},{"v":4000.03,"d":"4,000.03"},{"v":0.12,"d":"12.00%"},{"v":7786.02,"d":"7,786.02"},{"v":0.14,"d":"14.00%"},{"v":7786.02,"d":"7,786.02"},{"v":0.14,"d":"14.00%"},1090.04,21.18,101.18,181.18]
["2024-09-01",{"v":1412,"d":"1,412.00"},{"v":0.075,"d":"7.50%"},{"v":2666.68,"d":"2,666.68"},{"v":0.09,"d":"9.00%"},{"v":4000.03,"d":"4,000.03"},{"v":0.12,"d":"12.00%"},{"v":7786.02,"d":"7,786.02"},{"v":0.14,"d":"14.00%"},{"v":7786.02,"d":"7,786.02"},{"v":0.14,"d":"14.00%"},1090.04,21.18,101.18,181.18]
["2024-10-01",{"v":1412,"d":"1,412.00"},{"v":0.075,"d":"7.50%"},{"v":2666.68,"d":"2,666.68"},{"v":0.09,"d":"9.00%"},{"v":4000.03,"d":"4,000.03"},{"v":0.12,"d":"12.00%"},{"v":7786.02,"d":"7,786.02"},{"v":0.14,"d":"14.00%"},{"v":7786.02,"d":"7,786.02"},{"v":0.14,"d":"14.00%"},1090.04,21.18,101.18,181.18]
["2024-11-01",{"v":1412,"d":"1,412.00"},{"v":0.075,"d":"7.50%"},{"v":2666.68,"d":"2,666.68"},{"v":0.09,"d":"9.00%"},{"v":4000.03,"d":"4,000.03"},{"v":0.12,"d":"12.00%"},{"v":7786.02,"d":"7,786.02"},{"v":0.14,"d":"14.00%"},{"v":7786.02,"d":"7,786.02"},{"v":0.14,"d":"14.00%"},1090.04,21.18,101.18,181.18]
["2024-12-01",{"v":1412,"d":"1,412.00"},{"v":0.075,"d":"7.50%"},{"v":2666.68,"d":"2,666.68"},{"v":0.09,"d":"9.00%"},{"v":4000.03,"d":"4,000.03"},{"v":0.12,"d":"12.00%"},{"v":7786.02,"d":"7,786.02"},{"v":0.14,"d":"14.00%"},{"v":7786.02,"d":"7,786.02"},{"v":0.14,"d":"14.00%"},1090.04,21.18,101.18,181.18]

{"sheet":"Aliq_IRRF","index":5,"n_rows":411,"n_cols":17,"rows_kept":411,"merged":[[0,0,0,16]]}
["IRRF"]
[]
[]
["data","isenção","A DEDUZIR","1ª FAIXA","% IRRF","A DEDUZIR","2ª FAIXA","% IRRF","A DEDUZIR","3ª FAIXA","%IRRF","A DEDUZIR","4ª FAIXA","%IRRF","A DEDUZIR","Dependentes","DEDUÇÃO/ABONO"]
["1991-02-01",{"v":0,"d":"0.00%"},0,{"v":72311,"d":"72,311.00"},{"v":0.1,"d":"10.00%"},{"v":7231.1,"d":"7,231.10"},{"v":241038,"d":"241,038.00"},{"v":0.25,"d":"25.00%"},{"v":43386.8,"d":"43,386.80"},{"v":241038,"d":"241,038.00"},{"v":0.25,"d":"25.00%"},{"v":43386.8,"d":"43,386.80"},{"$f":"J5","v":{"v":241038,"d":"241,038.00"}},{"$f":"K5","v":{"v":0.25,"d":"25.00%"}},{"$f":"L5","v":{"v":43386.8,"d":"43,386.80"}}]
["1991-03-01",{"v":0,"d":"0.00%"},0,{"v":72311,"d":"72,311.00"},{"v":0.1,"d":"10.00%"},{"v":7231.1,"d":"7,231.10"},{"v":241038,"d":"241,038.00"},{"v":0.25,"d":"25.00%"},{"v":43386.8,"d":"43,386.80"},{"v":241038,"d":"241,038.00"},{"v":0.25,"d":"25.00%"},{"v":43386.8,"d":"43,386.80"},{"$f":"J6","v":{"v":241038,"d":"241,038.00"}},{"v":0.25,"d":"25.00%"},{"v":43386.8,"d":"43,386.80"}]
["1991-04-01",{"v":0,"d":"0.00%"},0,{"v":72311,"d":"72,311.00"},{"v":0.1,"d":"10.00%"},{"v":7231.1,"d":"7,231.10"},{"v":241038,"d":"241,038.00"},{"v":0.25,"d":"25.00%"},{"v":43386.8,"d":"43,386.80"},{"v":241038,"d":"241,038.00"},{"v":0.25,"d":"25.00%"},{"v":43386.8,"d":"43,386.80"},{"v":241038,"d":"241,038.00"},{"v":0.25,"d":"25.00%"},{"v":43386.8,"d":"43,386.80"}]
["1991-05-01",{"v":0,"d":"0.00%"},0,{"v":72311,"d":"72,311.00"},{"v":0.1,"d":"10.00%"},{"v":7231.1,"d":"7,231.10"},{"v":241038,"d":"241,038.00"},{"v":0.25,"d":"25.00%"},{"v":43386.8,"d":"43,386.80"},{"v":241038,"d":"241,038.00"},{"v":0.25,"d":"25.00%"},{"v":43386.8,"d":"43,386.80"},{"v":241038,"d":"241,038.00"},{"v":0.25,"d":"25.00%"},{"v":43386.8,"d":"43,386.80"}]
["1991-06-01",{"v":0,"d":"0.00%"},0,{"v":72311,"d":"72,311.00"},{"v":0.1,"d":"10.00%"},{"v":7231.1,"d":"7,231.10"},{"v":241038,"d":"241,038.00"},{"v":0.25,"d":"25.00%"},{"v":43386.8,"d":"43,386.80"},{"v":241038,"d":"241,038.00"},{"v":0.25,"d":"25.00%"},{"v":43386.8,"d":"43,386.80"},{"v":241038,"d":"241,038.00"},{"v":0.25,"d":"25.00%"},{"v":43386.8,"d":"43,386.80"}]
["1991-07-01",{"v":0,"d":"0.00%"},0,{"v":72311,"d":"72,311.00"},{"v":0.1,"d":"10.00%"},{"v":7231.1,"d":"7,231.10"},{"v":241038,"d":"241,038.00"},{"v":0.25,"d":"25.00%"},{"v":43386.8,"d":"43,386.80"},{"v":241038,"d":"241,038.00"},{"v":0.25,"d":"25.00%"},{"v":43386.8,"d":"43,386.80"},{"v":241038,"d":"241,038.00"},{"v":0.25,"d":"25.00%"},{"v":43386.8,"d":"43,386.80"}]
["1991-08-01",{"v":0,"d":"0.00%"},0,{"v":120000,"d":"120,000.00"},{"v":0.1,"d":"10.00%"},{"v":12000,"d":"12,000.00"},{"v":400000,"d":"400,000.00"},{"v":0.25,"d":"25.00%"},{"v":72000,"d":"72,000.00"},{"v":400000,"d":"400,000.00"},{"v":0.25,"d":"25.00%"},{"v":72000,"d":"72,000.00"},{"v":400000,"d":"400,000.00"},{"v":0.25,"d":"25.00%"},{"v":72000,"d":"72,000.00"}]
["1991-09-01",{"v":0,"d":"0.00%"},0,{"v":120000,"d":"120,000.00"},{"v":0.1,"d":"10.00%"},{"v":12000,"d":"12,000.00"},{"v":400000,"d":"400,000.00"},{"v":0.25,"d":"25.00%"},{"v":72000,"d":"72,000.00"},{"v":400000,"d":"400,000.00"},{"v":0.25,"d":"25.00%"},{"v":72000,"d":"72,000.00"},{"v":400000,"d":"400,000.00"},{"v":0.25,"d":"25.00%"},{"v":72000,"d":"72,000.00"}]
["1991-10-01",{"v":0,"d":"0.00%"},0,{"v":120000,"d":"120,000.00"},{"v":0.1,"d":"10.00%"},{"v":12000,"d":"12,000.00"},{"v":400000,"d":"400,000.00"},{"v":0.25,"d":"25.00%"},{"v":72000,"d":"72,000.00"},{"v":400000,"d":"400,000.00"},{"v":0.25,"d":"25.00%"},{"v":72000,"d":"72,000.00"},{"v":400000,"d":"400,000.00"},{"v":0.25,"d":"25.00%"},{"v":72000,"d":"72,000.00"}]
["1991-11-01",{"v":0,"d":"0.00%"},0,{"v":190000,"d":"190,000.00"},{"v":0.1,"d":"10.00%"},{"v":19000,"d":"19,000.00"},{"v":620000,"d":"620,000.00"},{"v":0.25,"d":"25.00%"},{"v":112000,"d":"112,000.00"},{"v":620000,"d":"620,000.00"},{"v":0.25,"d":"25.00%"},{"v":112000,"d":"112,000.00"},{"v":620000,"d":"620,000.00"},{"v":0.25,"d":"25.00%"},{"v":112000,"d":"112,000.00"}]
["1991-12-01",{"v":0,"d":"0.00%"},0,{"v":250000,"d":"250,000.00"},{"v":0.1,"d":"10.00%"},{"v":25000,"d":"25,000.00"},{"v":750000,"d":"750,000.00"},{"v":0.25,"d":"25.00%"},{"v":137500,"d":"137,500.00"},{"v":750000,"d":"750,000.00"},{"v":0.25,"d":"25.00%"},{"v":137500,"d":"137,500.00"},{"v":750000,"d":"750,000.00"},{"v":0.25,"d":"25.00%"},{"v":137500,"d":"137,500.00"}]
["1992-01-01",{"v":0,"d":"0.00%"},0,{"v":597060,"d":"597,060.00"},{"v":0.15,"d":"15.00%"},{"v":80559,"d":"80,559.00"},{"v":1164267,"d":"1,164,267.00"},{"v":0.25,"d":"25.00%"},{"v":205988,"d":"205,988.00"},{"v":1164267,"d":"1,164,267.00"},{"v":0.25,"d":"25.00%"},{"v":205988,"d":"205,988.00"},{"v":1164267,"d":"1,164,267.00"},{"v":0.25,"d":"25.00%"},{"v":205988,"d":"205,988.00"}]
["1992-02-01",{"v":0,"d":"0.00%"},0,{"v":749100,"d":"749,100.00"},{"v":0.15,"d":"15.00%"},{"v":112847,"d":"112,847.00"},{"v":1462324,"d":"1,462,324.00"},{"v":0.25,"d":"25.00%"},{"v":258719,"d":"258,719.00"},{"v":1462324,"d":"1,462,324.00"},{"v":0.25,"d":"25.00%"},{"v":258719,"d":"258,719.00"},{"v":1462324,"d":"1,462,324.00"},{"v":0.25,"d":"25.00%"},{"v":258719,"d":"258,719.00"}]
["1992-03-01",{"v":0,"d":"0.00%"},0,{"v":945640,"d":"945,640.00"},{"v":0.15,"d":"15.00%"},{"v":141846,"d":"141,846.00"},{"v":1843998,"d":"1,843,998.00"},{"v":0.25,"d":"25.00%"},{"v":326846,"d":"326,846.00"},{"v":1843998,"d":"1,843,998.00"},{"v":0.25,"d":"25.00%"},{"v":326846,"d":"326,846.00"},{"v":1843998,"d":"1,843,998.00"},{"v":0.25,"d":"25.00%"},{"v":326846,"d":"326,846.00"}]
["1992-04-01",{"v":0,"d":"0.00%"},0,{"v":1153960,"d":"1,153,960.00"},{"v":0.15,"d":"15.00%"},{"v":173094,"d":"173,094.00"},{"v":2250222,"d":"2,250,222.00"},{"v":0.25,"d":"25.00%"},{"v":398117,"d":"398,117.00"},{"v":2250222,"d":"2,250,222.00"},{"v":0.25,"d":"25.00%"},{"v":398117,"d":"398,117.00"},{"v":2250222,"d":"2,250,222.00"},{"v":0.25,"d":"25.00%"},{"v":398117,"d":"398,117.00"}]
["1992-05-01",{"v":0,"d":"0.00%"},0,{"v":1382790,"d":"1,382,790.00"},{"v":0.15,"d":"15.00%"},{"v":207419,"d":"207,419.00"},{"v":2698441,"d":"2,698,441.00"},{"v":0.25,"d":"25.00%"},{"v":477063,"d":"477,063.00"},{"v":2698441,"d":"2,698,441.00"},{"v":0.25,"d":"25.00%"},{"v":477063,"d":"477,063.00"},{"v":2698441,"d":"2,698,441.00"},{"v":0.25,"d":"25.00%"},{"v":477063,"d":"477,063.00"}]
["1992-06-01",{"v":0,"d":"0.00%"},0,{"v":1707050,"d":"1,707,050.00"},{"v":0.15,"d":"15.00%"},{"v":256058,"d":"256,058.00"},{"v":3328748,"d":"3,328,748.00"},{"v":0.25,"d":"25.00%"},{"v":588933,"d":"588,933.00"},{"v":3328748,"d":"3,328,748.00"},{"v":0.25,"d":"25.00%"},{"v":588933,"d":"588,933.00"},{"v":3328748,"d":"3,328,748.00"},{"v":0.25,"d":"25.00%"},{"v":588933,"d":"588,933.00"}]
["1992-07-01",{"v":0,"d":"0.00%"},0,{"v":2104280,"d":"2,104,280.00"},{"v":0.15,"d":"15.00%"},{"v":315642,"d":"315,642.00"},{"v":4103346,"d":"4,103,346.00"},{"v":0.25,"d":"25.00%"},{"v":725977,"d":"725,977.00"},{"v":4103346,"d":"4,103,346.00"},{"v":0.25,"d":"25.00%"},{"v":725977,"d":"725,977.00"},{"v":4103346,"d":"4,103,346.00"},{"v":0.25,"d":"25.00%"},{"v":725977,"d":"725,977.00"}]
["1992-08-01",{"v":0,"d":"0.00%"},0,{"v":2546390,"d":"2,546,390.00"},{"v":0.15,"d":"15.00%"},{"v":381959,"d":"381,959.00"},{"v":4695461,"d":"4,695,461.00"},{"v":0.25,"d":"25.00%"},{"v":878505,"d":"878,505.00"},{"v":4695461,"d":"4,695,461.00"},{"v":0.25,"d":"25.00%"},{"v":878505,"d":"878,505.00"},{"v":4695461,"d":"4,695,461.00"},{"v":0.25,"d":"25.00%"},{"v":878505,"d":"878,505.00"}]
["1992-09-01",{"v":0,"d":"0.00%"},0,{"v":3135620,"d":"3,135,620.00"},{"v":0.15,"d":"15.00%"},{"v":470343,"d":"470,343.00"},{"v":6114459,"d":"6,114,459.00"},{"v":0.25,"d":"25.00%"},{"v":1081789,"d":"1,081,789.00"},{"v":6114459,"d":"6,114,459.00"},{"v":0.25,"d":"25.00%"},{"v":1081789,"d":"1,081,789.00"},{"v":6114459,"d":"6,114,459.00"},{"v":0.25,"d":"25.00%"},{"v":1081789,"d":"1,081,789.00"}]
["1992-10-01",{"v":0,"d":"0.00%"},0,{"v":3867160,"d":"3,867,160.00"},{"v":0.15,"d":"15.00%"},{"v":580074,"d":"580,074.00"},{"v":7540962,"d":"7,540,962.00"},{"v":0.25,"d":"25.00%"},{"v":1334170,"d":"1,334,170.00"},{"v":7540962,"d":"7,540,962.00"},{"v":0.25,"d":"25.00%"},{"v":1334170,"d":"1,334,170.00"},{"v":7540962,"d":"7,540,962.00"},{"v":0.25,"d":"25.00%"},{"v":1334170,"d":"1,334,170.00"}]
["1992-11-01",{"v":0,"d":"0.00%"},0,{"v":4852510,"d":"4,852,510.00"},{"v":0.15,"d":"15.00%"},{"v":727877,"d":"727,877.00"},{"v":9462395,"d":"9,462,395.00"},{"v":0.25,"d":"25.00%"},{"v":1674117,"d":"1,674,117.00"},{"v":9462395,"d":"9,462,395.00"},{"v":0.25,"d":"25.00%"},{"v":1674117,"d":"1,674,117.00"},{"v":9462395,"d":"9,462,395.00"},{"v":0.25,"d":"25.00%"},{"v":1674117,"d":"1,674,117.00"}]
["1992-12-01",{"v":0,"d":"0.00%"},0,{"v":6002550,"d":"6,002,550.00"},{"v":0.15,"d":"15.00%"},{"v":900383,"d":"900,383.00"},{"v":11704973,"d":"11,704,973.00"},{"v":0.25,"d":"25.00%"},{"v":2070880,"d":"2,070,880.00"},{"v":11704973,"d":"11,704,973.00"},{"v":0.25,"d":"25.00%"},{"v":2070880,"d":"2,070,880.00"},{"v":11704973,"d":"11,704,973.00"},{"v":0.25,"d":"25.00%"},{"v":2070880,"d":"2,070,880.00"}]
["1993-01-01",{"v":0,"d":"0.00%"},0,{"v":7412550,"d":"7,412,550.00"},{"v":0.15,"d":"15.00%"},{"v":1111883,"d":"1,111,883.00"},{"v":14454742,"d":"14,454,742.00"},{"v":0.25,"d":"25.00%"},{"v":2557330,"d":"2,557,330.00"},{"v":14454742,"d":"14,454,742.00"},{"v":0.25,"d":"25.00%"},{"v":2557330,"d":"2,557,330.00"},{"v":14454742,"d":"14,454,742.00"},{"v":0.25,"d":"25.00%"},{"v":2557330,"d":"2,557,330.00"}]
["1993-02-01",{"v":0,"d":"0.00%"},0,{"v":9597030,"d":"9,597,030.00"},{"v":0.15,"d":"15.00%"},{"v":1439555,"d":"1,439,555.00"},{"v":18714209,"d":"18,714,209.00"},{"v":0.25,"d":"25.00%"},{"v":3310976,"d":"3,310,976.00"},{"v":18714209,"d":"18,714,209.00"},{"v":0.25,"d":"25.00%"},{"v":3310976,"d":"3,310,976.00"},{"v":18714209,"d":"18,714,209.00"},{"v":0.25,"d":"25.00%"},{"v":3310976,"d":"3,310,976.00"}]
["1993-03-01",{"v":0,"d":"0.00%"},0,{"v":12161360,"d":"12,161,360.00"},{"v":0.15,"d":"15.00%"},{"v":1824204,"d":"1,824,204.00"},{"v":23714652,"d":"23,714,652.00"},{"v":0.25,"d":"25.00%"},{"v":4195669,"d":"4,195,669.00"},{"v":23714652,"d":"23,714,652.00"},{"v":0.25,"d":"25.00%"},{"v":4195669,"d":"4,195,669.00"},{"v":23714652,"d":"23,714,652.00"},{"v":0.25,"d":"25.00%"},{"v":4195669,"d":"4,195,669.00"}]
["1993-04-01",{"v":0,"d":"0.00%"},0,{"v":15318450,"d":"15,318,450.00"},{"v":0.15,"d":"15.00%"},{"v":2297768,"d":"2,297,768.00"},{"v":29870978,"d":"29,870,978.00"},{"v":0.25,"d":"25.00%"},{"v":5284865,"d":"5,284,865.00"},{"v":29870978,"d":"29,870,978.00"},{"v":0.25,"d":"25.00%"},{"v":5284865,"d":"5,284,865.00"},{"v":29870978,"d":"29,870,978.00"},{"v":0.25,"d":"25.00%"},{"v":5284865,"d":"5,284,865.00"}]
["1993-05-01",{"v":0,"d":"0.00%"},0,{"v":19506520,"d":"19,506,520.00"},{"v":0.15,"d":"15.00%"},{"v":2925978,"d":"2,925,978.00"},{"v":38037714,"d":"38,037,714.00"},{"v":0.25,"d":"25.00%"},{"v":6729749,"d":"6,729,749.00"},{"v":38037714,"d":"38,037,714.00"},{"v":0.25,"d":"25.00%"},{"v":6729749,"d":"6,729,749.00"},{"v":38037714,"d":"38,037,714.00"},{"v":0.25,"d":"25.00%"},{"v":6729749,"d":"6,729,749.00"}]
["1993-06-01",{"v":0,"d":"0.00%"},0,{"v":25126350,"d":"25,126,350.00"},{"v":0.15,"d":"15.00%"},{"v":3768953,"d":"3,768,953.00"},{"v":48996382,"d":"48,996,382.00"},{"v":0.25,"d":"25.00%"},{"v":8668591,"d":"8,668,591.00"},{"v":48996382,"d":"48,996,382.00"},{"v":0.25,"d":"25.00%"},{"v":8668591,"d":"8,668,591.00"},{"v":48996382,"d":"48,996,382.00"},{"v":0.25,"d":"25.00%"},{"v":8668591,"d":"8,668,591.00"}]
["1993-07-01",{"v":0,"d":"0.00%"},0,{"v":32749680,"d":"32,749,680.00"},{"v":0.15,"d":"15.00%"},{"v":4912452,"d":"4,912,452.00"},{"v":63861876,"d":"63,861,876.00"},{"v":0.25,"d":"25.00%"},{"v":11298640,"d":"11,298,640.00"},{"v":63861876,"d":"63,861,876.00"},{"v":0.25,"d":"25.00%"},{"v":11298640,"d":"11,298,640.00"},{"v":63861876,"d":"63,861,876.00"},{"v":0.25,"d":"25.00%"},{"v":11298640,"d":"11,298,640.00"}]
["1993-08-01",{"v":0,"d":"0.00%"},0,{"v":42790,"d":"42,790.00"},{"v":0.15,"d":"15.00%"},{"v":6418.5,"d":"6,418.50"},{"v":83440.5,"d":"83,440.50"},{"v":0.25,"d":"25.00%"},{"v":14762.55,"d":"14,762.55"},{"v":83440.5,"d":"83,440.50"},{"v":0.25,"d":"25.00%"},{"v":14762.55,"d":"14,762.55"},{"v":83440.5,"d":"83,440.50"},{"v":0.25,"d":"25.00%"},{"v":14762.55,"d":"14,762.55"}]
["1993-09-01",{"v":0,"d":"0.00%"},0,{"v":56480,"d":"56,480.00"},{"v":0.15,"d":"15.00%"},{"v":8472,"d":"8,472.00"},{"v":110136,"d":"110,136.00"},{"v":0.25,"d":"25.00%"},{"v":19485.6,"d":"19,485.60"},{"v":110136,"d":"110,136.00"},{"v":0.25,"d":"25.00%"},{"v":19485.6,"d":"19,485.60"},{"v":110136,"d":"110,136.00"},{"v":0.25,"d":"25.00%"},{"v":19485.6,"d":"19,485.60"}]
["1993-10-01",{"v":0,"d":"0.00%"},0,{"v":75900,"d":"75,900.00"},{"v":0.15,"d":"15.00%"},{"v":11385,"d":"11,385.00"},{"v":148005,"d":"148,005.00"},{"v":0.25,"d":"25.00%"},{"v":26185.5,"d":"26,185.50"},{"v":148005,"d":"148,005.00"},{"v":0.25,"d":"25.00%"},{"v":26185.5,"d":"26,185.50"},{"v":148005,"d":"148,005.00"},{"v":0.25,"d":"25.00%"},{"v":26185.5,"d":"26,185.50"}]
["1993-11-01",{"v":0,"d":"0.00%"},0,{"v":102590,"d":"102,590.00"},{"v":0.15,"d":"15.00%"},{"v":15388.5,"d":"15,388.50"},{"v":200050.5,"d":"200,050.50"},{"v":0.25,"d":"25.00%"},{"v":35393.55,"d":"35,393.55"},{"v":200050.5,"d":"200,050.50"},{"v":0.25,"d":"25.00%"},{"v":35393.55,"d":"35,393.55"},{"v":200050.5,"d":"200,050.50"},{"v":0.25,"d":"25.00%"},{"v":35393.55,"d":"35,393.55"}]
["1993-12-01",{"v":0,"d":"0.00%"},0,{"v":137370,"d":"137,370.00"},{"v":0.15,"d":"15.00%"},{"v":20605.5,"d":"20,605.50"},{"v":267871.5,"d":"267,871.50"},{"v":0.25,"d":"25.00%"},{"v":67392.65,"d":"67,392.65"},{"v":267871.5,"d":"267,871.50"},{"v":0.25,"d":"25.00%"},{"v":67392.65,"d":"67,392.65"},{"v":267871.5,"d":"267,871.50"},{"v":0.25,"d":"25.00%"},{"v":67392.65,"d":"67,392.65"}]
["1994-01-01",{"v":0,"d":"0.00%"},0,{"v":187770,"d":"187,770.00"},{"v":0.15,"d":"15.00%"},{"v":28165.5,"d":"28,165.50"},{"v":366151.5,"d":"366,151.50"},{"v":0.266,"d":"26.60%"},{"v":70674.75,"d":"70,674.75"},{"v":3379860,"d":"3,379,860.00"},{"v":0.35,"d":"35.00%"},{"v":354556.7,"d":"354,556.70"},{"v":3379860,"d":"3,379,860.00"},{"v":0.35,"d":"35.00%"},{"v":354556.7,"d":"354,556.70"}]
["1994-02-01",{"v":0,"d":"0.00%"},0,{"v":261320,"d":"261,320.00"},{"v":0.15,"d":"15.00%"},{"v":39198,"d":"39,198.00"},{"v":509574,"d":"509,574.00"},{"v":0.266,"d":"26.60%"},{"v":98358.23,"d":"98,358.23"},{"v":4703760,"d":"4,703,760.00"},{"v":0.35,"d":"35.00%"},{"v":493437.49,"d":"493,437.49"},{"v":4703760,"d":"4,703,760.00"},{"v":0.35,"d":"35.00%"},{"v":493437.49,"d":"493,437.49"}]
["1994-03-01",{"v":0,"d":"0.00%"},0,{"v":365060,"d":"365,060.00"},{"v":0.15,"d":"15.00%"},{"v":54759,"d":"54,759.00"},{"v":711867,"d":"711,867.00"},{"v":0.266,"d":"26.60%"},{"v":137404.94,"d":"137,404.94"},{"v":6571080,"d":"6,571,080.00"},{"v":0.35,"d":"35.00%"},{"v":689324.55,"d":"689,324.55"},{"v":6571080,"d":"6,571,080.00"},{"v":0.35,"d":"35.00%"},{"v":689324.55,"d":"689,324.55"}]
["1994-04-01",{"v":0,"d":"0.00%"},0,{"v":524340,"d":"524,340.00"},{"v":0.15,"d":"15.00%"},{"v":78651,"d":"78,651.00"},{"v":1022463,"d":"1,022,463.00"},{"v":0.266,"d":"26.60%"},{"v":197356.33,"d":"197,356.33"},{"v":9438120,"d":"9,438,120.00"},{"v":0.35,"d":"35.00%"},{"v":990085.01,"d":"990,085.01"},{"v":9438120,"d":"9,438,120.00"},{"v":0.35,"d":"35.00%"},{"v":990085.01,"d":"990,085.01"}]
["1994-05-01",{"v":0,"d":"0.00%"},0,{"v":740630,"d":"740,630.00"},{"v":0.15,"d":"15.00%"},{"v":111094.5,"d":"111,094.50"},{"v":1444228.5,"d":"1,444,228.50"},{"v":0.266,"d":"26.60%"},{"v":278765.73,"d":"278,765.73"},{"v":13331340,"d":"13,331,340.00"},{"v":0.35,"d":"35.00%"},{"v":1398493.6,"d":"1,398,493.60"},{"v":13331340,"d":"13,331,340.00"},{"v":0.35,"d":"35.00%"},{"v":1398493.6,"d":"1,398,493.60"}]
["1994-06-01",{"v":0,"d":"0.00%"},0,{"v":1068060,"d":"1,068,060.00"},{"v":0.15,"d":"15.00%"},{"v":160209,"d":"160,209.00"},{"v":2082717,"d":"2,082,717.00"},{"v":0.266,"d":"26.60%"},{"v":402007.1,"d":"402,007.10"},{"v":19225080,"d":"19,225,080.00"},{"v":0.35,"d":"35.00%"},{"v":2016764.3,"d":"2,016,764.30"},{"v":19225080,"d":"19,225,080.00"},{"v":0.35,"d":"35.00%"},{"v":2016764.3,"d":"2,016,764.30"}]
["1994-07-01",{"v":0,"d":"0.00%"},0,{"v":561.8,"d":"561.80"},{"v":0.15,"d":"15.00%"},84.27,{"v":1095.51,"d":"1,095.51"},{"v":0.266,"d":"26.60%"},211.46,{"v":10112.4,"d":"10,112.40"},{"v":0.35,"d":"35.00%"},{"v":1060.82,"d":"1,060.82"},{"v":10112.4,"d":"10,112.40"},{"v":0.35,"d":"35.00%"},{"v":1060.82,"d":"1,060.82"},22.47]
["1994-08-01",{"v":0,"d":"0.00%"},0,{"v":591.1,"d":"591.10"},{"v":0.15,"d":"15.00%"},88.66,{"v":1152.65,"d":"1,152.65"},{"v":0.266,"d":"26.60%"},222.49,{"v":10639.8,"d":"10,639.80"},{"v":0.35,"d":"35.00%"},{"v":1116.14,"d":"1,116.14"},{"v":10639.8,"d":"10,639.80"},{"v":0.35,"d":"35.00%"},{"v":1116.14,"d":"1,116.14"},23.64]
["1994-09-01",{"v":0,"d":"0.00%"},0,620.71,{"v":0.15,"d":"15.00%"},{"v":93.1,"d":"93.10"},{"v":1210.36,"d":"1,210.36"},{"v":0.266,"d":"26.60%"},233.63,{"v":11172.6,"d":"11,172.60"},{"v":0.35,"d":"35.00%"},{"v":1172.04,"d":"1,172.04"},{"v":11172.6,"d":"11,172.60"},{"v":0.35,"d":"35.00%"},{"v":1172.04,"d":"1,172.04"},62.07]
["1994-10-01",{"v":0,"d":"0.00%"},0,{"v":630.8,"d":"630.80"},{"v":0.15,"d":"15.00%"},94.62,{"v":1230.06,"d":"1,230.06"},{"v":0.266,"d":"26.60%"},237.43,{"v":11354.4,"d":"11,354.40"},{"v":0.35,"d":"35.00%"},{"v":1191.11,"d":"1,191.11"},{"v":11354.4,"d":"11,354.40"},{"v":0.35,"d":"35.00%"},{"v":1191.11,"d":"1,191.11"},63.08]
["1994-11-01",{"v":0,"d":"0.00%"},0,{"v":642.8,"d":"642.80"},{"v":0.15,"d":"15.00%"},96.42,{"v":1253.47,"d":"1,253.47"},{"v":0.266,"d":"26.60%"},241.94,{"v":11570.4,"d":"11,570.40"},{"v":0.35,"d":"35.00%"},{"v":1213.77,"d":"1,213.77"},{"v":11570.4,"d":"11,570.40"},{"v":0.35,"d":"35.00%"},{"v":1213.77,"d":"1,213.77"},64.28]
["1994-12-01",{"v":0,"d":"0.00%"},0,{"v":661.8,"d":"661.80"},{"v":0.15,"d":"15.00%"},99.27,{"v":1290.51,"d":"1,290.51"},{"v":0.266,"d":"26.60%"},249.09,{"v":11912.4,"d":"11,912.40"},{"v":0.35,"d":"35.00%"},{"v":1249.64,"d":"1,249.64"},{"v":11912.4,"d":"11,912.40"},{"v":0.35,"d":"35.00%"},{"v":1249.64,"d":"1,249.64"},66.18]
["1995-01-01",{"v":0,"d":"0.00%"},0,{"v":676.7,"d":"676.70"},{"v":0.15,"d":"15.00%"},101.51,{"v":1319.57,"d":"1,319.57"},{"v":0.266,"d":"26.60%"},{"v":254.7,"d":"254.70"},{"v":12180.6,"d":"12,180.60"},{"v":0.35,"d":"35.00%"},{"v":1277.78,"d":"1,277.78"},{"v":12180.6,"d":"12,180.60"},{"v":0.35,"d":"35.00%"},{"v":1277.78,"d":"1,277.78"},67.67]
["1995-02-01",{"v":0,"d":"0.00%"},0,{"v":676.7,"d":"676.70"},{"v":0.15,"d":"15.00%"},101.51,{"v":1319.57,"d":"1,319.57"},{"v":0.266,"d":"26.60%"},{"v":254.7,"d":"254.70"},{"v":12180.6,"d":"12,180.60"},{"v":0.35,"d":"35.00%"},{"v":1277.78,"d":"1,277.78"},{"v":12180.6,"d":"12,180.60"},{"v":0.35,"d":"35.00%"},{"v":1277.78,"d":"1,277.78"},67.67]
["1995-03-01",{"v":0,"d":"0.00%"},0,{"v":676.7,"d":"676.70"},{"v":0.15,"d":"15.00%"},101.51,{"v":1319.57,"d":"1,319.57"},{"v":0.266,"d":"26.60%"},{"v":254.7,"d":"254.70"},{"v":12180.6,"d":"12,180.60"},{"v":0.35,"d":"35.00%"},{"v":1277.78,"d":"1,277.78"},{"v":12180.6,"d":"12,180.60"},{"v":0.35,"d":"35.00%"},{"v":1277.78,"d":"1,277.78"},67.67]
["1995-04-01",{"v":0,"d":"0.00%"},0,{"v":706,"d":"706.00"},{"v":0.15,"d":"15.00%"},105.91,{"v":1376.84,"d":"1,376.84"},{"v":0.266,"d":"26.60%"},265.76,{"v":12709.24,"d":"12,709.24"},{"v":0.35,"d":"35.00%"},{"v":1333.23,"d":"1,333.23"},{"v":12709.24,"d":"12,709.24"},{"v":0.35,"d":"35.00%"},{"v":1333.23,"d":"1,333.23"},70.61]
["1995-05-01",{"v":0,"d":"0.00%"},0,{"v":706,"d":"706.00"},{"v":0.15,"d":"15.00%"},105.91,{"v":1376.84,"d":"1,376.84"},{"v":0.266,"d":"26.60%"},265.76,{"v":12709.24,"d":"12,709.24"},{"v":0.35,"d":"35.00%"},{"v":1333.23,"d":"1,333.23"},{"v":12709.24,"d":"12,709.24"},{"v":0.35,"d":"35.00%"},{"v":1333.23,"d":"1,333.23"},70.61]
["1995-06-01",{"v":0,"d":"0.00%"},0,{"v":706,"d":"706.00"},{"v":0.15,"d":"15.00%"},105.91,{"v":1376.84,"d":"1,376.84"},{"v":0.266,"d":"26.60%"},265.76,{"v":12709.24,"d":"12,709.24"},{"v":0.35,"d":"35.00%"},{"v":1333.23,"d":"1,333.23"},{"v":12709.24,"d":"12,709.24"},{"v":0.35,"d":"35.00%"},{"v":1333.23,"d":"1,333.23"},70.61]
["1995-07-01",{"v":0,"d":"0.00%"},0,756.44,{"v":0.15,"d":"15.00%"},113.47,{"v":1475.01,"d":"1,475.01"},{"v":0.266,"d":"26.60%"},284.71,{"v":13615.41,"d":"13,615.41"},{"v":0.35,"d":"35.00%"},{"v":1428.29,"d":"1,428.29"},{"v":13615.41,"d":"13,615.41"},{"v":0.35,"d":"35.00%"},{"v":1428.29,"d":"1,428.29"},75.64]
["1995-08-01",{"v":0,"d":"0.00%"},0,756.44,{"v":0.15,"d":"15.00%"},113.47,{"v":1475.01,"d":"1,475.01"},{"v":0.266,"d":"26.60%"},284.71,{"v":13615.41,"d":"13,615.41"},{"v":0.35,"d":"35.00%"},{"v":1428.29,"d":"1,428.29"},{"v":13615.41,"d":"13,615.41"},{"v":0.35,"d":"35.00%"},{"v":1428.29,"d":"1,428.29"},75.64]
["1995-09-01",{"v":0,"d":"0.00%"},0,756.44,{"v":0.15,"d":"15.00%"},113.47,{"v":1475.01,"d":"1,475.01"},{"v":0.266,"d":"26.60%"},284.71,{"v":13615.41,"d":"13,615.41"},{"v":0.35,"d":"35.00%"},{"v":1428.29,"d":"1,428.29"},{"v":13615.41,"d":"13,615.41"},{"v":0.35,"d":"35.00%"},{"v":1428.29,"d":"1,428.29"},75.64]
["1995-10-01",{"v":0,"d":"0.00%"},0,795.24,{"v":0.15,"d":"15.00%"},119.29,{"v":1550.68,"d":"1,550.68"},{"v":0.266,"d":"26.60%"},299.32,{"v":14313.88,"d":"14,313.88"},{"v":0.35,"d":"35.00%"},{"v":1501.57,"d":"1,501.57"},{"v":14313.88,"d":"14,313.88"},{"v":0.35,"d":"35.00%"},{"v":1501.57,"d":"1,501.57"},79.52]
["1995-11-01",{"v":0,"d":"0.00%"},0,795.24,{"v":0.15,"d":"15.00%"},119.29,{"v":1550.68,"d":"1,550.68"},{"v":0.266,"d":"26.60%"},299.32,{"v":14313.88,"d":"14,313.88"},{"v":0.35,"d":"35.00%"},{"v":1501.57,"d":"1,501.57"},{"v":14313.88,"d":"14,313.88"},{"v":0.35,"d":"35.00%"},{"v":1501.57,"d":"1,501.57"},79.52]
["1995-12-01",{"v":0,"d":"0.00%"},0,795.24,{"v":0.15,"d":"15.00%"},119.29,{"v":1550.68,"d":"1,550.68"},{"v":0.266,"d":"26.60%"},299.32,{"v":14313.88,"d":"14,313.88"},{"v":0.35,"d":"35.00%"},{"v":1501.57,"d":"1,501.57"},{"v":14313.88,"d":"14,313.88"},{"v":0.35,"d":"35.00%"},{"v":1501.57,"d":"1,501.57"},79.52]
["1996-01-01",{"v":0,"d":"0.00%"},0,{"v":900,"d":"900.00"},{"v":0.15,"d":"15.00%"},{"v":135,"d":"135.00"},{"v":1800,"d":"1,800.00"},{"v":0.25,"d":"25.00%"},{"v":315,"d":"315.00"},{"v":1800,"d":"1,800.00"},{"v":0.25,"d":"25.00%"},{"v":315,"d":"315.00"},{"v":1800,"d":"1,800.00"},{"v":0.25,"d":"25.00%"},{"v":315,"d":"315.00"},{"v":90,"d":"90.00"}]
["1996-02-01",{"v":0,"d":"0.00%"},0,{"v":900,"d":"900.00"},{"v":0.15,"d":"15.00%"},{"v":135,"d":"135.00"},{"v":1800,"d":"1,800.00"},{"v":0.25,"d":"25.00%"},{"v":315,"d":"315.00"},{"v":1800,"d":"1,800.00"},{"v":0.25,"d":"25.00%"},{"v":315,"d":"315.00"},{"v":1800,"d":"1,800.00"},{"v":0.25,"d":"25.00%"},{"v":315,"d":"315.00"},{"v":90,"d":"90.00"}]
["1996-03-01",{"v":0,"d":"0.00%"},0,{"v":900,"d":"900.00"},{"v":0.15,"d":"15.00%"},{"v":135,"d":"135.00"},{"v":1800,"d":"1,800.00"},{"v":0.25,"d":"25.00%"},{"v":315,"d":"315.00"},{"v":1800,"d":"1,800.00"},{"v":0.25,"d":"25.00%"},{"v":315,"d":"315.00"},{"v":1800,"d":"1,800.00"},{"v":0.25,"d":"25.00%"},{"v":315,"d":"315.00"},{"v":90,"d":"90.00"}]
["1996-04-01",{"v":0,"d":"0.00%"},0,{"v":900,"d":"900.00"},{"v":0.15,"d":"15.00%"},{"v":135,"d":"135.00"},{"v":1800,"d":"1,800.00"},{"v":0.25,"d":"25.00%"},{"v":315,"d":"315.00"},{"v":1800,"d":"1,800.00"},{"v":0.25,"d":"25.00%"},{"v":315,"d":"315.00"},{"v":1800,"d":"1,800.00"},{"v":0.25,"d":"25.00%"},{"v":315,"d":"315.00"},{"v":90,"d":"90.00"}]
["1996-05-01",{"v":0,"d":"0.00%"},0,{"v":900,"d":"900.00"},{"v":0.15,"d":"15.00%"},{"v":135,"d":"135.00"},{"v":1800,"d":"1,800.00"},{"v":0.25,"d":"25.00%"},{"v":315,"d":"315.00"},{"v":1800,"d":"1,800.00"},{"v":0.25,"d":"25.00%"},{"v":315,"d":"315.00"},{"v":1800,"d":"1,800.00"},{"v":0.25,"d":"25.00%"},{"v":315,"d":"315.00"},{"v":90,"d":"90.00"}]
["1996-06-01",{"v":0,"d":"0.00%"},0,{"v":900,"d":"900.00"},{"v":0.15,"d":"15.00%"},{"v":135,"d":"135.00"},{"v":1800,"d":"1,800.00"},{"v":0.25,"d":"25.00%"},{"v":315,"d":"315.00"},{"v":1800,"d":"1,800.00"},{"v":0.25,"d":"25.00%"},{"v":315,"d":"315.00"},{"v":1800,"d":"1,800.00"},{"v":0.25,"d":"25.00%"},{"v":315,"d":"315.00"},{"v":90,"d":"90.00"}]
["1996-07-01",{"v":0,"d":"0.00%"},0,{"v":900,"d":"900.00"},{"v":0.15,"d":"15.00%"},{"v":135,"d":"135.00"},{"v":1800,"d":"1,800.00"},{"v":0.25,"d":"25.00%"},{"v":315,"d":"315.00"},{"v":1800,"d":"1,800.00"},{"v":0.25,"d":"25.00%"},{"v":315,"d":"315.00"},{"$f":"J70","v":{"v":1800,"d":"1,800.00"}},{"v":0.25,"d":"25.00%"},{"v":315,"d":"315.00"},{"v":90,"d":"90.00"}]
["1996-08-01",{"v":0,"d":"0.00%"},0,{"v":900,"d":"900.00"},{"v":0.15,"d":"15.00%"},{"v":135,"d":"135.00"},{"v":1800,"d":"1,800.00"},{"v":0.25,"d":"25.00%"},{"v":315,"d":"315.00"},{"v":1800,"d":"1,800.00"},{"v":0.25,"d":"25.00%"},{"v":315,"d":"315.00"},{"v":1800,"d":"1,800.00"},{"v":0.25,"d":"25.00%"},{"v":315,"d":"315.00"},{"v":90,"d":"90.00"}]
["1996-09-01",{"v":0,"d":"0.00%"},0,{"v":900,"d":"900.00"},{"v":0.15,"d":"15.00%"},{"v":135,"d":"135.00"},{"v":1800,"d":"1,800.00"},{"v":0.25,"d":"25.00%"},{"v":315,"d":"315.00"},{"v":1800,"d":"1,800.00"},{"v":0.25,"d":"25.00%"},{"v":315,"d":"315.00"},{"v":1800,"d":"1,800.00"},{"v":0.25,"d":"25.00%"},{"v":315,"d":"315.00"},{"v":90,"d":"90.00"}]
["1996-10-01",{"v":0,"d":"0.00%"},0,{"v":900,"d":"900.00"},{"v":0.15,"d":"15.00%"},{"v":135,"d":"135.00"},{"v":1800,"d":"1,800.00"},{"v":0.25,"d":"25.00%"},{"v":315,"d":"315.00"},{"v":1800,"d":"1,800.00"},{"v":0.25,"d":"25.00%"},{"v":315,"d":"315.00"},{"v":1800,"d":"1,800.00"},{"v":0.25,"d":"25.00%"},{"v":315,"d":"315.00"},{"v":90,"d":"90.00"}]
["1996-11-01",{"v":0,"d":"0.00%"},0,{"v":900,"d":"900.00"},{"v":0.15,"d":"15.00%"},{"v":135,"d":"135.00"},{"v":1800,"d":"1,800.00"},{"v":0.25,"d":"25.00%"},{"v":315,"d":"315.00"},{"v":1800,"d":"1,800.00"},{"v":0.25,"d":"25.00%"},{"v":315,"d":"315.00"},{"v":1800,"d":"1,800.00"},{"v":0.25,"d":"25.00%"},{"v":315,"d":"315.00"},{"v":90,"d":"90.00"}]
["1996-12-01",{"v":0,"d":"0.00%"},0,{"v":900,"d":"900.00"},{"v":0.15,"d":"15.00%"},{"v":135,"d":"135.00"},{"v":1800,"d":"1,800.00"},{"v":0.25,"d":"25.00%"},{"v":315,"d":"315.00"},{"v":1800,"d":"1,800.00"},{"v":0.25,"d":"25.00%"},{"v":315,"d":"315.00"},{"v":1800,"d":"1,800.00"},{"v":0.25,"d":"25.00%"},{"v":315,"d":"315.00"},{"v":90,"d":"90.00"}]
["1997-01-01",{"v":0,"d":"0.00%"},0,{"v":900,"d":"900.00"},{"v":0.15,"d":"15.00%"},{"v":135,"d":"135.00"},{"v":1800,"d":"1,800.00"},{"v":0.25,"d":"25.00%"},{"v":315,"d":"315.00"},{"v":1800,"d":"1,800.00"},{"v":0.25,"d":"25.00%"},{"v":315,"d":"315.00"},{"v":1800,"d":"1,800.00"},{"v":0.25,"d":"25.00%"},{"v":315,"d":"315.00"},{"v":90,"d":"90.00"}]
["1997-02-01",{"v":0,"d":"0.00%"},0,{"v":900,"d":"900.00"},{"v":0.15,"d":"15.00%"},{"v":135,"d":"135.00"},{"v":1800,"d":"1,800.00"},{"v":0.25,"d":"25.00%"},{"v":315,"d":"315.00"},{"v":1800,"d":"1,800.00"},{"v":0.25,"d":"25.00%"},{"v":315,"d":"315.00"},{"v":1800,"d":"1,800.00"},{"v":0.25,"d":"25.00%"},{"v":315,"d":"315.00"},{"v":90,"d":"90.00"}]
["1997-03-01",{"v":0,"d":"0.00%"},0,{"v":900,"d":"900.00"},{"v":0.15,"d":"15.00%"},{"v":135,"d":"135.00"},{"v":1800,"d":"1,800.00"},{"v":0.25,"d":"25.00%"},{"v":315,"d":"315.00"},{"v":1800,"d":"1,800.00"},{"v":0.25,"d":"25.00%"},{"v":315,"d":"315.00"},{"v":1800,"d":"1,800.00"},{"v":0.25,"d":"25.00%"},{"v":315,"d":"315.00"},{"v":90,"d":"90.00"}]
["1997-04-01",{"v":0,"d":"0.00%"},0,{"v":900,"d":"900.00"},{"v":0.15,"d":"15.00%"},{"v":135,"d":"135.00"},{"v":1800,"d":"1,800.00"},{"v":0.25,"d":"25.00%"},{"v":315,"d":"315.00"},{"v":1800,"d":"1,800.00"},{"v":0.25,"d":"25.00%"},{"v":315,"d":"315.00"},{"v":1800,"d":"1,800.00"},{"v":0.25,"d":"25.00%"},{"v":315,"d":"315.00"},{"v":90,"d":"90.00"}]
["1997-05-01",{"v":0,"d":"0.00%"},0,{"v":900,"d":"900.00"},{"v":0.15,"d":"15.00%"},{"v":135,"d":"135.00"},{"v":1800,"d":"1,800.00"},{"v":0.25,"d":"25.00%"},{"v":315,"d":"315.00"},{"v":1800,"d":"1,800.00"},{"v":0.25,"d":"25.00%"},{"v":315,"d":"315.00"},{"v":1800,"d":"1,800.00"},{"v":0.25,"d":"25.00%"},{"v":315,"d":"315.00"},{"v":90,"d":"90.00"}]
["1997-06-01",{"v":0,"d":"0.00%"},0,{"v":900,"d":"900.00"},{"v":0.15,"d":"15.00%"},{"v":135,"d":"135.00"},{"v":1800,"d":"1,800.00"},{"v":0.25,"d":"25.00%"},{"v":315,"d":"315.00"},{"v":1800,"d":"1,800.00"},{"v":0.25,"d":"25.00%"},{"v":315,"d":"315.00"},{"v":1800,"d":"1,800.00"},{"v":0.25,"d":"25.00%"},{"v":315,"d":"315.00"},{"v":90,"d":"90.00"}]
["1997-07-01",{"v":0,"d":"0.00%"},0,{"v":900,"d":"900.00"},{"v":0.15,"d":"15.00%"},{"v":135,"d":"135.00"},{"v":1800,"d":"1,800.00"},{"v":0.25,"d":"25.00%"},{"v":315,"d":"315.00"},{"v":1800,"d":"1,800.00"},{"v":0.25,"d":"25.00%"},{"v":315,"d":"315.00"},{"v":1800,"d":"1,800.00"},{"v":0.25,"d":"25.00%"},{"v":315,"d":"315.00"},{"v":90,"d":"90.00"}]
["1997-08-01",{"v":0,"d":"0.00%"},0,{"v":900,"d":"900.00"},{"v":0.15,"d":"15.00%"},{"v":135,"d":"135.00"},{"v":1800,"d":"1,800.00"},{"v":0.25,"d":"25.00%"},{"v":315,"d":"315.00"},{"v":1800,"d":"1,800.00"},{"v":0.25,"d":"25.00%"},{"v":315,"d":"315.00"},{"v":1800,"d":"1,800.00"},{"v":0.25,"d":"25.00%"},{"v":315,"d":"315.00"},{"v":90,"d":"90.00"}]
["1997-09-01",{"v":0,"d":"0.00%"},0,{"v":900,"d":"900.00"},{"v":0.15,"d":"15.00%"},{"v":135,"d":"135.00"},{"v":1800,"d":"1,800.00"},{"v":0.25,"d":"25.00%"},{"v":315,"d":"315.00"},{"v":1800,"d":"1,800.00"},{"v":0.25,"d":"25.00%"},{"v":315,"d":"315.00"},{"v":1800,"d":"1,800.00"},{"v":0.25,"d":"25.00%"},{"v":315,"d":"315.00"},{"v":90,"d":"90.00"}]
["1997-10-01",{"v":0,"d":"0.00%"},0,{"v":900,"d":"900.00"},{"v":0.15,"d":"15.00%"},{"v":135,"d":"135.00"},{"v":1800,"d":"1,800.00"},{"v":0.25,"d":"25.00%"},{"v":315,"d":"315.00"},{"v":1800,"d":"1,800.00"},{"v":0.25,"d":"25.00%"},{"v":315,"d":"315.00"},{"v":1800,"d":"1,800.00"},{"v":0.25,"d":"25.00%"},{"v":315,"d":"315.00"},{"v":90,"d":"90.00"}]
["1997-11-01",{"v":0,"d":"0.00%"},0,{"v":900,"d":"900.00"},{"v":0.15,"d":"15.00%"},{"v":135,"d":"135.00"},{"v":1800,"d":"1,800.00"},{"v":0.25,"d":"25.00%"},{"v":315,"d":"315.00"},{"v":1800,"d":"1,800.00"},{"v":0.25,"d":"25.00%"},{"v":315,"d":"315.00"},{"v":1800,"d":"1,800.00"},{"v":0.25,"d":"25.00%"},{"v":315,"d":"315.00"},{"v":90,"d":"90.00"}]
["1997-12-01",{"v":0,"d":"0.00%"},0,{"v":900,"d":"900.00"},{"v":0.15,"d":"15.00%"},{"v":135,"d":"135.00"},{"v":1800,"d":"1,800.00"},{"v":0.25,"d":"25.00%"},{"v":315,"d":"315.00"},{"v":1800,"d":"1,800.00"},{"v":0.25,"d":"25.00%"},{"v":315,"d":"315.00"},{"v":1800,"d":"1,800.00"},{"v":0.25,"d":"25.00%"},{"v":315,"d":"315.00"},{"v":90,"d":"90.00"}]
["1998-01-01",{"v":0,"d":"0.00%"},0,{"v":900,"d":"900.00"},{"v":0.15,"d":"15.00%"},{"v":135,"d":"135.00"},{"v":1800,"d":"1,800.00"},{"v":0.275,"d":"27.50%"},{"v":360,"d":"360.00"},{"v":1800,"d":"1,800.00"},{"v":0.275,"d":"27.50%"},{"v":360,"d":"360.00"},{"v":1800,"d":"1,800.00"},{"v":0.275,"d":"27.50%"},{"v":360,"d":"360.00"},{"v":90,"d":"90.00"}]
["1998-02-01",{"v":0,"d":"0.00%"},0,{"v":900,"d":"900.00"},{"v":0.15,"d":"15.00%"},{"v":135,"d":"135.00"},{"v":1800,"d":"1,800.00"},{"v":0.275,"d":"27.50%"},{"v":360,"d":"360.00"},{"v":1800,"d":"1,800.00"},{"v":0.275,"d":"27.50%"},{"v":360,"d":"360.00"},{"v":1800,"d":"1,800.00"},{"v":0.275,"d":"27.50%"},{"v":360,"d":"360.00"},{"v":90,"d":"90.00"}]
["1998-03-01",{"v":0,"d":"0.00%"},0,{"v":900,"d":"900.00"},{"v":0.15,"d":"15.00%"},{"v":135,"d":"135.00"},{"v":1800,"d":"1,800.00"},{"v":0.275,"d":"27.50%"},{"v":360,"d":"360.00"},{"v":1800,"d":"1,800.00"},{"v":0.275,"d":"27.50%"},{"v":360,"d":"360.00"},{"v":1800,"d":"1,800.00"},{"v":0.275,"d":"27.50%"},{"v":360,"d":"360.00"},{"v":90,"d":"90.00"}]
["1998-04-01",{"v":0,"d":"0.00%"},0,{"v":900,"d":"900.00"},{"v":0.15,"d":"15.00%"},{"v":135,"d":"135.00"},{"v":1800,"d":"1,800.00"},{"v":0.275,"d":"27.50%"},{"v":360,"d":"360.00"},{"v":1800,"d":"1,800.00"},{"v":0.275,"d":"27.50%"},{"v":360,"d":"360.00"},{"v":1800,"d":"1,800.00"},{"v":0.275,"d":"27.50%"},{"v":360,"d":"360.00"},{"v":90,"d":"90.00"}]
["1998-05-01",{"v":0,"d":"0.00%"},0,{"v":900,"d":"900.00"},{"v":0.15,"d":"15.00%"},{"v":135,"d":"135.00"},{"v":1800,"d":"1,800.00"},{"v":0.275,"d":"27.50%"},{"v":360,"d":"360.00"},{"v":1800,"d":"1,800.00"},{"v":0.275,"d":"27.50%"},{"v":360,"d":"360.00"},{"v":1800,"d":"1,800.00"},{"v":0.275,"d":"27.50%"},{"v":360,"d":"360.00"},{"v":90,"d":"90.00"}]
["1998-06-01",{"v":0,"d":"0.00%"},0,{"v":900,"d":"900.00"},{"v":0.15,"d":"15.00%"},{"v":135,"d":"135.00"},{"v":1800,"d":"1,800.00"},{"v":0.275,"d":"27.50%"},{"v":360,"d":"360.00"},{"v":1800,"d":"1,800.00"},{"v":0.275,"d":"27.50%"},{"v":360,"d":"360.00"},{"v":1800,"d":"1,800.00"},{"v":0.275,"d":"27.50%"},{"v":360,"d":"360.00"},{"v":90,"d":"90.00"}]
["1998-07-01",{"v":0,"d":"0.00%"},0,{"v":900,"d":"900.00"},{"v":0.15,"d":"15.00%"},{"v":135,"d":"135.00"},{"v":1800,"d":"1,800.00"},{"v":0.275,"d":"27.50%"},{"v":360,"d":"360.00"},{"v":1800,"d":"1,800.00"},{"v":0.275,"d":"27.50%"},{"v":360,"d":"360.00"},{"v":1800,"d":"1,800.00"},{"v":0.275,"d":"27.50%"},{"v":360,"d":"360.00"},{"v":90,"d":"90.00"}]
["1998-08-01",{"v":0,"d":"0.00%"},0,{"v":900,"d":"900.00"},{"v":0.15,"d":"15.00%"},{"v":135,"d":"135.00"},{"v":1800,"d":"1,800.00"},{"v":0.275,"d":"27.50%"},{"v":360,"d":"360.00"},{"v":1800,"d":"1,800.00"},{"v":0.275,"d":"27.50%"},{"v":360,"d":"360.00"},{"v":1800,"d":"1,800.00"},{"v":0.275,"d":"27.50%"},{"v":360,"d":"360.00"},{"v":90,"d":"90.00"}]
["1998-09-01",{"v":0,"d":"0.00%"},0,{"v":900,"d":"900.00"},{"v":0.15,"d":"15.00%"},{"v":135,"d":"135.00"},{"v":1800,"d":"1,800.00"},{"v":0.275,"d":"27.50%"},{"v":360,"d":"360.00"},{"v":1800,"d":"1,800.00"},{"v":0.275,"d":"27.50%"},{"v":360,"d":"360.00"},{"v":1800,"d":"1,800.00"},{"v":0.275,"d":"27.50%"},{"v":360,"d":"360.00"},{"v":90,"d":"90.00"}]
["1998-10-01",{"v":0,"d":"0.00%"},0,{"v":900,"d":"900.00"},{"v":0.15,"d":"15.00%"},{"v":135,"d":"135.00"},{"v":1800,"d":"1,800.00"},{"v":0.275,"d":"27.50%"},{"v":360,"d":"360.00"},{"v":1800,"d":"1,800.00"},{"v":0.275,"d":"27.50%"},{"v":360,"d":"360.00"},{"v":1800,"d":"1,800.00"},{"v":0.275,"d":"27.50%"},{"v":360,"d":"360.00"},{"v":90,"d":"90.00"}]
["1998-11-01",{"v":0,"d":"0.00%"},0,{"v":900,"d":"900.00"},{"v":0.15,"d":"15.00%"},{"v":135,"d":"135.00"},{"v":1800,"d":"1,800.00"},{"v":0.275,"d":"27.50%"},{"v":360,"d":"360.00"},{"v":1800,"d":"1,800.00"},{"v":0.275,"d":"27.50%"},{"v":360,"d":"360.00"},{"v":1800,"d":"1,800.00"},{"v":0.275,"d":"27.50%"},{"v":360,"d":"360.00"},{"v":90,"d":"90.00"}]
["1998-12-01",{"v":0,"d":"0.00%"},0,{"v":900,"d":"900.00"},{"v":0.15,"d":"15.00%"},{"v":135,"d":"135.00"},{"v":1800,"d":"1,800.00"},{"v":0.275,"d":"27.50%"},{"v":360,"d":"360.00"},{"v":1800,"d":"1,800.00"},{"v":0.275,"d":"27.50%"},{"v":360,"d":"360.00"},{"v":1800,"d":"1,800.00"},{"v":0.275,"d":"27.50%"},{"v":360,"d":"360.00"},{"v":90,"d":"90.00"}]
["1999-01-01",{"v":0,"d":"0.00%"},0,{"v":900,"d":"900.00"},{"v":0.15,"d":"15.00%"},{"v":135,"d":"135.00"},{"v":1800,"d":"1,800.00"},{"v":0.275,"d":"27.50%"},{"v":360,"d":"360.00"},{"v":1800,"d":"1,800.00"},{"v":0.275,"d":"27.50%"},{"v":360,"d":"360.00"},{"v":1800,"d":"1,800.00"},{"v":0.275,"d":"27.50%"},{"v":360,"d":"360.00"},{"v":90,"d":"90.00"}]
["1999-02-01",{"v":0,"d":"0.00%"},0,{"v":900,"d":"900.00"},{"v":0.15,"d":"15.00%"},{"v":135,"d":"135.00"},{"v":1800,"d":"1,800.00"},{"v":0.275,"d":"27.50%"},{"v":360,"d":"360.00"},{"v":1800,"d":"1,800.00"},{"v":0.275,"d":"27.50%"},{"v":360,"d":"360.00"},{"v":1800,"d":"1,800.00"},{"v":0.275,"d":"27.50%"},{"v":360,"d":"360.00"},{"v":90,"d":"90.00"}]
["1999-03-01",{"v":0,"d":"0.00%"},0,{"v":900,"d":"900.00"},{"v":0.15,"d":"15.00%"},{"v":135,"d":"135.00"},{"v":1800,"d":"1,800.00"},{"v":0.275,"d":"27.50%"},{"v":360,"d":"360.00"},{"v":1800,"d":"1,800.00"},{"v":0.275,"d":"27.50%"},{"v":360,"d":"360.00"},{"v":1800,"d":"1,800.00"},{"v":0.275,"d":"27.50%"},{"v":360,"d":"360.00"},{"v":90,"d":"90.00"}]
["1999-04-01",{"v":0,"d":"0.00%"},0,{"v":900,"d":"900.00"},{"v":0.15,"d":"15.00%"},{"v":135,"d":"135.00"},{"v":1800,"d":"1,800.00"},{"v":0.275,"d":"27.50%"},{"v":360,"d":"360.00"},{"v":1800,"d":"1,800.00"},{"v":0.275,"d":"27.50%"},{"v":360,"d":"360.00"},{"v":1800,"d":"1,800.00"},{"v":0.275,"d":"27.50%"},{"v":360,"d":"360.00"},{"v":90,"d":"90.00"}]
["1999-05-01",{"v":0,"d":"0.00%"},0,{"v":900,"d":"900.00"},{"v":0.15,"d":"15.00%"},{"v":135,"d":"135.00"},{"v":1800,"d":"1,800.00"},{"v":0.275,"d":"27.50%"},{"v":360,"d":"360.00"},{"v":1800,"d":"1,800.00"},{"v":0.275,"d":"27.50%"},{"v":360,"d":"360.00"},{"v":1800,"d":"1,800.00"},{"v":0.275,"d":"27.50%"},{"v":360,"d":"360.00"},{"v":90,"d":"90.00"}]
["1999-06-01",{"v":0,"d":"0.00%"},0,{"v":900,"d":"900.00"},{"v":0.15,"d":"15.00%"},{"v":135,"d":"135.00"},{"v":1800,"d":"1,800.00"},{"v":0.275,"d":"27.50%"},{"v":360,"d":"360.00"},{"v":1800,"d":"1,800.00"},{"v":0.275,"d":"27.50%"},{"v":360,"d":"360.00"},{"v":1800,"d":"1,800.00"},{"v":0.275,"d":"27.50%"},{"v":360,"d":"360.00"},{"v":90,"d":"90.00"}]
["1999-07-01",{"v":0,"d":"0.00%"},0,{"v":900,"d":"900.00"},{"v":0.15,"d":"15.00%"},{"v":135,"d":"135.00"},{"v":1800,"d":"1,800.00"},{"v":0.275,"d":"27.50%"},{"v":360,"d":"360.00"},{"v":1800,"d":"1,800.00"},{"v":0.275,"d":"27.50%"},{"v":360,"d":"360.00"},{"v":1800,"d":"1,800.00"},{"v":0.275,"d":"27.50%"},{"v":360,"d":"360.00"},{"v":90,"d":"90.00"}]
["1999-08-01",{"v":0,"d":"0.00%"},0,{"v":900,"d":"900.00"},{"v":0.15,"d":"15.00%"},{"v":135,"d":"135.00"},{"v":1800,"d":"1,800.00"},{"v":0.275,"d":"27.50%"},{"v":360,"d":"360.00"},{"v":1800,"d":"1,800.00"},{"v":0.275,"d":"27.50%"},{"v":360,"d":"360.00"},{"v":1800,"d":"1,800.00"},{"v":0.275,"d":"27.50%"},{"v":360,"d":"360.00"},{"v":90,"d":"90.00"}]
["1999-09-01",{"v":0,"d":"0.00%"},0,{"v":900,"d":"900.00"},{"v":0.15,"d":"15.00%"},{"v":135,"d":"135.00"},{"v":1800,"d":"1,800.00"},{"v":0.275,"d":"27.50%"},{"v":360,"d":"360.00"},{"v":1800,"d":"1,800.00"},{"v":0.275,"d":"27.50%"},{"v":360,"d":"360.00"},{"v":1800,"d":"1,800.00"},{"v":0.275,"d":"27.50%"},{"v":360,"d":"360.00"},{"v":90,"d":"90.00"}]
["1999-10-01",{"v":0,"d":"0.00%"},0,{"v":900,"d":"900.00"},{"v":0.15,"d":"15.00%"},{"v":135,"d":"135.00"},{"v":1800,"d":"1,800.00"},{"v":0.275,"d":"27.50%"},{"v":360,"d":"360.00"},{"v":1800,"d":"1,800.00"},{"v":0.275,"d":"27.50%"},{"v":360,"d":"360.00"},{"v":1800,"d":"1,800.00"},{"v":0.275,"d":"27.50%"},{"v":360,"d":"360.00"},{"v":90,"d":"90.00"}]
["1999-11-01",{"v":0,"d":"0.00%"},0,{"v":900,"d":"900.00"},{"v":0.15,"d":"15.00%"},{"v":135,"d":"135.00"},{"v":1800,"d":"1,800.00"},{"v":0.275,"d":"27.50%"},{"v":360,"d":"360.00"},{"v":1800,"d":"1,800.00"},{"v":0.275,"d":"27.50%"},{"v":360,"d":"360.00"},{"v":1800,"d":"1,800.00"},{"v":0.275,"d":"27.50%"},{"v":360,"d":"360.00"},{"v":90,"d":"90.00"}]
["1999-12-01",{"v":0,"d":"0.00%"},0,{"v":900,"d":"900.00"},{"v":0.15,"d":"15.00%"},{"v":135,"d":"135.00"},{"v":1800,"d":"1,800.00"},{"v":0.275,"d":"27.50%"},{"v":360,"d":"360.00"},{"v":1800,"d":"1,800.00"},{"v":0.275,"d":"27.50%"},{"v":360,"d":"360.00"},{"v":1800,"d":"1,800.00"},{"v":0.275,"d":"27.50%"},{"v":360,"d":"360.00"},{"v":90,"d":"90.00"}]
["2000-01-01",{"v":0,"d":"0.00%"},0,{"v":900,"d":"900.00"},{"v":0.15,"d":"15.00%"},{"v":135,"d":"135.00"},{"v":1800,"d":"1,800.00"},{"v":0.275,"d":"27.50%"},{"v":360,"d":"360.00"},{"v":1800,"d":"1,800.00"},{"v":0.275,"d":"27.50%"},{"v":360,"d":"360.00"},{"v":1800,"d":"1,800.00"},{"v":0.275,"d":"27.50%"},{"v":360,"d":"360.00"},{"v":90,"d":"90.00"}]
["2000-02-01",{"v":0,"d":"0.00%"},0,{"v":900,"d":"900.00"},{"v":0.15,"d":"15.00%"},{"v":135,"d":"135.00"},{"v":1800,"d":"1,800.00"},{"v":0.275,"d":"27.50%"},{"v":360,"d":"360.00"},{"v":1800,"d":"1,800.00"},{"v":0.275,"d":"27.50%"},{"v":360,"d":"360.00"},{"v":1800,"d":"1,800.00"},{"v":0.275,"d":"27.50%"},{"v":360,"d":"360.00"},{"v":90,"d":"90.00"}]
["2000-03-01",{"v":0,"d":"0.00%"},0,{"v":900,"d":"900.00"},{"v":0.15,"d":"15.00%"},{"v":135,"d":"135.00"},{"v":1800,"d":"1,800.00"},{"v":0.275,"d":"27.50%"},{"v":360,"d":"360.00"},{"v":1800,"d":"1,800.00"},{"v":0.275,"d":"27.50%"},{"v":360,"d":"360.00"},{"v":1800,"d":"1,800.00"},{"v":0.275,"d":"27.50%"},{"v":360,"d":"360.00"},{"v":90,"d":"90.00"}]
["2000-04-01",{"v":0,"d":"0.00%"},0,{"v":900,"d":"900.00"},{"v":0.15,"d":"15.00%"},{"v":135,"d":"135.00"},{"v":1800,"d":"1,800.00"},{"v":0.275,"d":"27.50%"},{"v":360,"d":"360.00"},{"v":1800,"d":"1,800.00"},{"v":0.275,"d":"27.50%"},{"v":360,"d":"360.00"},{"v":1800,"d":"1,800.00"},{"v":0.275,"d":"27.50%"},{"v":360,"d":"360.00"},{"v":90,"d":"90.00"}]
["2000-05-01",{"v":0,"d":"0.00%"},0,{"v":900,"d":"900.00"},{"v":0.15,"d":"15.00%"},{"v":135,"d":"135.00"},{"v":1800,"d":"1,800.00"},{"v":0.275,"d":"27.50%"},{"v":360,"d":"360.00"},{"v":1800,"d":"1,800.00"},{"v":0.275,"d":"27.50%"},{"v":360,"d":"360.00"},{"v":1800,"d":"1,800.00"},{"v":0.275,"d":"27.50%"},{"v":360,"d":"360.00"},{"v":90,"d":"90.00"}]
["2000-06-01",{"v":0,"d":"0.00%"},0,{"v":900,"d":"900.00"},{"v":0.15,"d":"15.00%"},{"v":135,"d":"135.00"},{"v":1800,"d":"1,800.00"},{"v":0.275,"d":"27.50%"},{"v":360,"d":"360.00"},{"v":1800,"d":"1,800.00"},{"v":0.275,"d":"27.50%"},{"v":360,"d":"360.00"},{"v":1800,"d":"1,800.00"},{"v":0.275,"d":"27.50%"},{"v":360,"d":"360.00"},{"v":90,"d":"90.00"}]
["2000-07-01",{"v":0,"d":"0.00%"},0,{"v":900,"d":"900.00"},{"v":0.15,"d":"15.00%"},{"v":135,"d":"135.00"},{"v":1800,"d":"1,800.00"},{"v":0.275,"d":"27.50%"},{"v":360,"d":"360.00"},{"v":1800,"d":"1,800.00"},{"v":0.275,"d":"27.50%"},{"v":360,"d":"360.00"},{"v":1800,"d":"1,800.00"},{"v":0.275,"d":"27.50%"},{"v":360,"d":"360.00"},{"v":90,"d":"90.00"}]
["2000-08-01",{"v":0,"d":"0.00%"},0,{"v":900,"d":"900.00"},{"v":0.15,"d":"15.00%"},{"v":135,"d":"135.00"},{"v":1800,"d":"1,800.00"},{"v":0.275,"d":"27.50%"},{"v":360,"d":"360.00"},{"v":1800,"d":"1,800.00"},{"v":0.275,"d":"27.50%"},{"v":360,"d":"360.00"},{"v":1800,"d":"1,800.00"},{"v":0.275,"d":"27.50%"},{"v":360,"d":"360.00"},{"v":90,"d":"90.00"}]
["2000-09-01",{"v":0,"d":"0.00%"},0,{"v":900,"d":"900.00"},{"v":0.15,"d":"15.00%"},{"v":135,"d":"135.00"},{"v":1800,"d":"1,800.00"},{"v":0.275,"d":"27.50%"},{"v":360,"d":"360.00"},{"v":1800,"d":"1,800.00"},{"v":0.275,"d":"27.50%"},{"v":360,"d":"360.00"},{"v":1800,"d":"1,800.00"},{"v":0.275,"d":"27.50%"},{"v":360,"d":"360.00"},{"v":90,"d":"90.00"}]
["2000-10-01",{"v":0,"d":"0.00%"},0,{"v":900,"d":"900.00"},{"v":0.15,"d":"15.00%"},{"v":135,"d":"135.00"},{"v":1800,"d":"1,800.00"},{"v":0.275,"d":"27.50%"},{"v":360,"d":"360.00"},{"v":1800,"d":"1,800.00"},{"v":0.275,"d":"27.50%"},{"v":360,"d":"360.00"},{"v":1800,"d":"1,800.00"},{"v":0.275,"d":"27.50%"},{"v":360,"d":"360.00"},{"v":90,"d":"90.00"}]
["2000-11-01",{"v":0,"d":"0.00%"},0,{"v":900,"d":"900.00"},{"v":0.15,"d":"15.00%"},{"v":135,"d":"135.00"},{"v":1800,"d":"1,800.00"},{"v":0.275,"d":"27.50%"},{"v":360,"d":"360.00"},{"v":1800,"d":"1,800.00"},{"v":0.275,"d":"27.50%"},{"v":360,"d":"360.00"},{"v":1800,"d":"1,800.00"},{"v":0.275,"d":"27.50%"},{"v":360,"d":"360.00"},{"v":90,"d":"90.00"}]
["2000-12-01",{"v":0,"d":"0.00%"},0,{"v":900,"d":"900.00"},{"v":0.15,"d":"15.00%"},{"v":135,"d":"135.00"},{"v":1800,"d":"1,800.00"},{"v":0.275,"d":"27.50%"},{"v":360,"d":"360.00"},{"v":1800,"d":"1,800.00"},{"v":0.275,"d":"27.50%"},{"v":360,"d":"360.00"},{"v":1800,"d":"1,800.00"},{"v":0.275,"d":"27.50%"},{"v":360,"d":"360.00"},{"v":90,"d":"90.00"}]
["2001-01-01",{"v":0,"d":"0.00%"},0,{"v":900,"d":"900.00"},{"v":0.15,"d":"15.00%"},{"v":135,"d":"135.00"},{"v":1800,"d":"1,800.00"},{"v":0.275,"d":"27.50%"},{"v":360,"d":"360.00"},{"v":1800,"d":"1,800.00"},{"v":0.275,"d":"27.50%"},{"v":360,"d":"360.00"},{"v":1800,"d":"1,800.00"},{"v":0.275,"d":"27.50%"},{"v":360,"d":"360.00"},{"v":90,"d":"90.00"}]
["2001-02-01",{"v":0,"d":"0.00%"},0,{"v":900,"d":"900.00"},{"v":0.15,"d":"15.00%"},{"v":135,"d":"135.00"},{"v":1800,"d":"1,800.00"},{"v":0.275,"d":"27.50%"},{"v":360,"d":"360.00"},{"v":1800,"d":"1,800.00"},{"v":0.275,"d":"27.50%"},{"v":360,"d":"360.00"},{"v":1800,"d":"1,800.00"},{"v":0.275,"d":"27.50%"},{"v":360,"d":"360.00"},{"v":90,"d":"90.00"}]
["2001-03-01",{"v":0,"d":"0.00%"},0,{"v":900,"d":"900.00"},{"v":0.15,"d":"15.00%"},{"v":135,"d":"135.00"},{"v":1800,"d":"1,800.00"},{"v":0.275,"d":"27.50%"},{"v":360,"d":"360.00"},{"v":1800,"d":"1,800.00"},{"v":0.275,"d":"27.50%"},{"v":360,"d":"360.00"},{"v":1800,"d":"1,800.00"},{"v":0.275,"d":"27.50%"},{"v":360,"d":"360.00"},{"v":90,"d":"90.00"}]
["2001-04-01",{"v":0,"d":"0.00%"},0,{"v":900,"d":"900.00"},{"v":0.15,"d":"15.00%"},{"v":135,"d":"135.00"},{"v":1800,"d":"1,800.00"},{"v":0.275,"d":"27.50%"},{"v":360,"d":"360.00"},{"v":1800,"d":"1,800.00"},{"v":0.275,"d":"27.50%"},{"v":360,"d":"360.00"},{"v":1800,"d":"1,800.00"},{"v":0.275,"d":"27.50%"},{"v":360,"d":"360.00"},{"v":90,"d":"90.00"}]
["2001-05-01",{"v":0,"d":"0.00%"},0,{"v":900,"d":"900.00"},{"v":0.15,"d":"15.00%"},{"v":135,"d":"135.00"},{"v":1800,"d":"1,800.00"},{"v":0.275,"d":"27.50%"},{"v":360,"d":"360.00"},{"v":1800,"d":"1,800.00"},{"v":0.275,"d":"27.50%"},{"v":360,"d":"360.00"},{"v":1800,"d":"1,800.00"},{"v":0.275,"d":"27.50%"},{"v":360,"d":"360.00"},{"v":90,"d":"90.00"}]
["2001-06-01",{"v":0,"d":"0.00%"},0,{"v":900,"d":"900.00"},{"v":0.15,"d":"15.00%"},{"v":135,"d":"135.00"},{"v":1800,"d":"1,800.00"},{"v":0.275,"d":"27.50%"},{"v":360,"d":"360.00"},{"v":1800,"d":"1,800.00"},{"v":0.275,"d":"27.50%"},{"v":360,"d":"360.00"},{"v":1800,"d":"1,800.00"},{"v":0.275,"d":"27.50%"},{"v":360,"d":"360.00"},{"v":90,"d":"90.00"}]
["2001-07-01",{"v":0,"d":"0.00%"},0,{"v":900,"d":"900.00"},{"v":0.15,"d":"15.00%"},{"v":135,"d":"135.00"},{"v":1800,"d":"1,800.00"},{"v":0.275,"d":"27.50%"},{"v":360,"d":"360.00"},{"v":1800,"d":"1,800.00"},{"v":0.275,"d":"27.50%"},{"v":360,"d":"360.00"},{"v":1800,"d":"1,800.00"},{"v":0.275,"d":"27.50%"},{"v":360,"d":"360.00"},{"v":90,"d":"90.00"}]
["2001-08-01",{"v":0,"d":"0.00%"},0,{"v":900,"d":"900.00"},{"v":0.15,"d":"15.00%"},{"v":135,"d":"135.00"},{"v":1800,"d":"1,800.00"},{"v":0.275,"d":"27.50%"},{"v":360,"d":"360.00"},{"v":1800,"d":"1,800.00"},{"v":0.275,"d":"27.50%"},{"v":360,"d":"360.00"},{"v":1800,"d":"1,800.00"},{"v":0.275,"d":"27.50%"},{"v":360,"d":"360.00"},{"v":90,"d":"90.00"}]
["2001-09-01",{"v":0,"d":"0.00%"},0,{"v":900,"d":"900.00"},{"v":0.15,"d":"15.00%"},{"v":135,"d":"135.00"},{"v":1800,"d":"1,800.00"},{"v":0.275,"d":"27.50%"},{"v":360,"d":"360.00"},{"v":1800,"d":"1,800.00"},{"v":0.275,"d":"27.50%"},{"v":360,"d":"360.00"},{"v":1800,"d":"1,800.00"},{"v":0.275,"d":"27.50%"},{"v":360,"d":"360.00"},{"v":90,"d":"90.00"}]
["2001-10-01",{"v":0,"d":"0.00%"},0,{"v":900,"d":"900.00"},{"v":0.15,"d":"15.00%"},{"v":135,"d":"135.00"},{"v":1800,"d":"1,800.00"},{"v":0.275,"d":"27.50%"},{"v":360,"d":"360.00"},{"v":1800,"d":"1,800.00"},{"v":0.275,"d":"27.50%"},{"v":360,"d":"360.00"},{"v":1800,"d":"1,800.00"},{"v":0.275,"d":"27.50%"},{"v":360,"d":"360.00"},{"v":90,"d":"90.00"}]
["2001-11-01",{"v":0,"d":"0.00%"},0,{"v":900,"d":"900.00"},{"v":0.15,"d":"15.00%"},{"v":135,"d":"135.00"},{"v":1800,"d":"1,800.00"},{"v":0.275,"d":"27.50%"},{"v":360,"d":"360.00"},{"v":1800,"d":"1,800.00"},{"v":0.275,"d":"27.50%"},{"v":360,"d":"360.00"},{"$f":"J134","v":{"v":1800,"d":"1,800.00"}},{"v":0.275,"d":"27.50%"},{"v":360,"d":"360.00"},{"v":90,"d":"90.00"}]
["2001-12-01",{"v":0,"d":"0.00%"},0,{"v":900,"d":"900.00"},{"v":0.15,"d":"15.00%"},{"v":135,"d":"135.00"},{"v":1800,"d":"1,800.00"},{"v":0.275,"d":"27.50%"},{"v":360,"d":"360.00"},{"v":1800,"d":"1,800.00"},{"v":0.275,"d":"27.50%"},{"v":360,"d":"360.00"},{"v":1800,"d":"1,800.00"},{"v":0.275,"d":"27.50%"},{"v":360,"d":"360.00"},{"v":90,"d":"90.00"}]
["2002-01-01",{"v":0,"d":"0.00%"},0,{"v":900,"d":"900.00"},{"v":0.15,"d":"15.00%"},{"v":135,"d":"135.00"},{"v":1800,"d":"1,800.00"},{"v":0.275,"d":"27.50%"},{"v":360,"d":"360.00"},{"v":1800,"d":"1,800.00"},{"v":0.275,"d":"27.50%"},{"v":360,"d":"360.00"},{"v":1800,"d":"1,800.00"},{"v":0.275,"d":"27.50%"},{"v":360,"d":"360.00"},{"v":106,"d":"106.00"}]
["2002-02-01",{"v":0,"d":"0.00%"},0,{"v":900,"d":"900.00"},{"v":0.15,"d":"15.00%"},{"v":135,"d":"135.00"},{"v":1800,"d":"1,800.00"},{"v":0.275,"d":"27.50%"},{"v":360,"d":"360.00"},{"v":1800,"d":"1,800.00"},{"v":0.275,"d":"27.50%"},{"v":360,"d":"360.00"},{"v":1800,"d":"1,800.00"},{"v":0.275,"d":"27.50%"},{"v":360,"d":"360.00"},{"v":106,"d":"106.00"}]
["2002-03-01",{"v":0,"d":"0.00%"},0,{"v":900,"d":"900.00"},{"v":0.15,"d":"15.00%"},{"v":135,"d":"135.00"},{"v":1800,"d":"1,800.00"},{"v":0.275,"d":"27.50%"},{"v":360,"d":"360.00"},{"v":1800,"d":"1,800.00"},{"v":0.275,"d":"27.50%"},{"v":360,"d":"360.00"},{"v":1800,"d":"1,800.00"},{"v":0.275,"d":"27.50%"},{"v":360,"d":"360.00"},{"v":106,"d":"106.00"}]
["2002-04-01",{"v":0,"d":"0.00%"},0,{"v":900,"d":"900.00"},{"v":0.15,"d":"15.00%"},{"v":135,"d":"135.00"},{"v":1800,"d":"1,800.00"},{"v":0.275,"d":"27.50%"},{"v":360,"d":"360.00"},{"v":1800,"d":"1,800.00"},{"v":0.275,"d":"27.50%"},{"v":360,"d":"360.00"},{"v":1800,"d":"1,800.00"},{"v":0.275,"d":"27.50%"},{"v":360,"d":"360.00"},{"v":106,"d":"106.00"}]
["2002-05-01",{"v":0,"d":"0.00%"},0,{"v":900,"d":"900.00"},{"v":0.15,"d":"15.00%"},{"v":135,"d":"135.00"},{"v":1800,"d":"1,800.00"},{"v":0.275,"d":"27.50%"},{"v":360,"d":"360.00"},{"v":1800,"d":"1,800.00"},{"v":0.275,"d":"27.50%"},{"v":360,"d":"360.00"},{"v":1800,"d":"1,800.00"},{"v":0.275,"d":"27.50%"},{"v":360,"d":"360.00"},{"v":106,"d":"106.00"}]
["2002-06-01",{"v":0,"d":"0.00%"},0,{"v":900,"d":"900.00"},{"v":0.15,"d":"15.00%"},{"v":135,"d":"135.00"},{"v":1800,"d":"1,800.00"},{"v":0.275,"d":"27.50%"},{"v":360,"d":"360.00"},{"v":1800,"d":"1,800.00"},{"v":0.275,"d":"27.50%"},{"v":360,"d":"360.00"},{"v":1800,"d":"1,800.00"},{"v":0.275,"d":"27.50%"},{"v":360,"d":"360.00"},{"v":106,"d":"106.00"}]
["2002-07-01",{"v":0,"d":"0.00%"},0,{"v":900,"d":"900.00"},{"v":0.15,"d":"15.00%"},{"v":135,"d":"135.00"},{"v":1800,"d":"1,800.00"},{"v":0.275,"d":"27.50%"},{"v":360,"d":"360.00"},{"v":1800,"d":"1,800.00"},{"v":0.275,"d":"27.50%"},{"v":360,"d":"360.00"},{"v":1800,"d":"1,800.00"},{"v":0.275,"d":"27.50%"},{"v":360,"d":"360.00"},{"v":106,"d":"106.00"}]
["2002-08-01",{"v":0,"d":"0.00%"},0,{"v":900,"d":"900.00"},{"v":0.15,"d":"15.00%"},{"v":135,"d":"135.00"},{"v":1800,"d":"1,800.00"},{"v":0.275,"d":"27.50%"},{"v":360,"d":"360.00"},{"v":1800,"d":"1,800.00"},{"v":0.275,"d":"27.50%"},{"v":360,"d":"360.00"},{"v":1800,"d":"1,800.00"},{"v":0.275,"d":"27.50%"},{"v":360,"d":"360.00"},{"v":106,"d":"106.00"}]
["2002-09-01",{"v":0,"d":"0.00%"},0,{"v":900,"d":"900.00"},{"v":0.15,"d":"15.00%"},{"v":135,"d":"135.00"},{"v":1800,"d":"1,800.00"},{"v":0.275,"d":"27.50%"},{"v":360,"d":"360.00"},{"v":1800,"d":"1,800.00"},{"v":0.275,"d":"27.50%"},{"v":360,"d":"360.00"},{"v":1800,"d":"1,800.00"},{"v":0.275,"d":"27.50%"},{"v":360,"d":"360.00"},{"v":106,"d":"106.00"}]
["2002-10-01",{"v":0,"d":"0.00%"},0,{"v":900,"d":"900.00"},{"v":0.15,"d":"15.00%"},{"v":135,"d":"135.00"},{"v":1800,"d":"1,800.00"},{"v":0.275,"d":"27.50%"},{"v":360,"d":"360.00"},{"v":1800,"d":"1,800.00"},{"v":0.275,"d":"27.50%"},{"v":360,"d":"360.00"},{"v":1800,"d":"1,800.00"},{"v":0.275,"d":"27.50%"},{"v":360,"d":"360.00"},{"v":106,"d":"106.00"}]
["2002-11-01",{"v":0,"d":"0.00%"},0,{"v":900,"d":"900.00"},{"v":0.15,"d":"15.00%"},{"v":135,"d":"135.00"},{"v":1800,"d":"1,800.00"},{"v":0.275,"d":"27.50%"},{"v":360,"d":"360.00"},{"v":1800,"d":"1,800.00"},{"v":0.275,"d":"27.50%"},{"v":360,"d":"360.00"},{"v":1800,"d":"1,800.00"},{"v":0.275,"d":"27.50%"},{"v":360,"d":"360.00"},{"v":106,"d":"106.00"}]
["2002-12-01",{"v":0,"d":"0.00%"},0,{"v":900,"d":"900.00"},{"v":0.15,"d":"15.00%"},{"v":135,"d":"135.00"},{"v":1800,"d":"1,800.00"},{"v":0.275,"d":"27.50%"},{"v":360,"d":"360.00"},{"v":1800,"d":"1,800.00"},{"v":0.275,"d":"27.50%"},{"v":360,"d":"360.00"},{"v":1800,"d":"1,800.00"},{"v":0.275,"d":"27.50%"},{"v":360,"d":"360.00"},{"v":106,"d":"106.00"}]
["2003-01-01",{"v":0,"d":"0.00%"},0,{"v":1058.01,"d":"1,058.01"},{"v":0.15,"d":"15.00%"},{"v":158.7,"d":"158.70"},{"v":2115,"d":"2,115.00"},{"v":0.275,"d":"27.50%"},423.08,{"v":2115,"d":"2,115.00"},{"v":0.275,"d":"27.50%"},423.08,{"v":2115,"d":"2,115.00"},{"v":0.275,"d":"27.50%"},423.08,{"v":106,"d":"106.00"}]
["2003-02-01",{"v":0,"d":"0.00%"},0,{"v":1058.01,"d":"1,058.01"},{"v":0.15,"d":"15.00%"},{"v":158.7,"d":"158.70"},{"v":2115,"d":"2,115.00"},{"v":0.275,"d":"27.50%"},423.08,{"v":2115,"d":"2,115.00"},{"v":0.275,"d":"27.50%"},423.08,{"v":2115,"d":"2,115.00"},{"v":0.275,"d":"27.50%"},423.08,{"v":106,"d":"106.00"}]
["2003-03-01",{"v":0,"d":"0.00%"},0,{"v":1058.01,"d":"1,058.01"},{"v":0.15,"d":"15.00%"},{"v":158.7,"d":"158.70"},{"v":2115,"d":"2,115.00"},{"v":0.275,"d":"27.50%"},423.08,{"v":2115,"d":"2,115.00"},{"v":0.275,"d":"27.50%"},423.08,{"v":2115,"d":"2,115.00"},{"v":0.275,"d":"27.50%"},423.08,{"v":106,"d":"106.00"}]
["2003-04-01",{"v":0,"d":"0.00%"},0,{"v":1058.01,"d":"1,058.01"},{"v":0.15,"d":"15.00%"},{"v":158.7,"d":"158.70"},{"v":2115,"d":"2,115.00"},{"v":0.275,"d":"27.50%"},423.08,{"v":2115,"d":"2,115.00"},{"v":0.275,"d":"27.50%"},423.08,{"v":2115,"d":"2,115.00"},{"v":0.275,"d":"27.50%"},423.08,{"v":106,"d":"106.00"}]
["2003-05-01",{"v":0,"d":"0.00%"},0,{"v":1058.01,"d":"1,058.01"},{"v":0.15,"d":"15.00%"},{"v":158.7,"d":"158.70"},{"v":2115,"d":"2,115.00"},{"v":0.275,"d":"27.50%"},423.08,{"v":2115,"d":"2,115.00"},{"v":0.275,"d":"27.50%"},423.08,{"v":2115,"d":"2,115.00"},{"v":0.275,"d":"27.50%"},423.08,{"v":106,"d":"106.00"}]
["2003-06-01",{"v":0,"d":"0.00%"},0,{"v":1058.01,"d":"1,058.01"},{"v":0.15,"d":"15.00%"},{"v":158.7,"d":"158.70"},{"v":2115,"d":"2,115.00"},{"v":0.275,"d":"27.50%"},423.08,{"v":2115,"d":"2,115.00"},{"v":0.275,"d":"27.50%"},423.08,{"v":2115,"d":"2,115.00"},{"v":0.275,"d":"27.50%"},423.08,{"v":106,"d":"106.00"}]
["2003-07-01",{"v":0,"d":"0.00%"},0,{"v":1058.01,"d":"1,058.01"},{"v":0.15,"d":"15.00%"},{"v":158.7,"d":"158.70"},{"v":2115,"d":"2,115.00"},{"v":0.275,"d":"27.50%"},423.08,{"v":2115,"d":"2,115.00"},{"v":0.275,"d":"27.50%"},423.08,{"v":2115,"d":"2,115.00"},{"v":0.275,"d":"27.50%"},423.08,{"v":106,"d":"106.00"}]
["2003-08-01",{"v":0,"d":"0.00%"},0,{"v":1058.01,"d":"1,058.01"},{"v":0.15,"d":"15.00%"},{"v":158.7,"d":"158.70"},{"v":2115,"d":"2,115.00"},{"v":0.275,"d":"27.50%"},423.08,{"v":2115,"d":"2,115.00"},{"v":0.275,"d":"27.50%"},423.08,{"v":2115,"d":"2,115.00"},{"v":0.275,"d":"27.50%"},423.08,{"v":106,"d":"106.00"}]
["2003-09-01",{"v":0,"d":"0.00%"},0,{"v":1058.01,"d":"1,058.01"},{"v":0.15,"d":"15.00%"},{"v":158.7,"d":"158.70"},{"v":2115,"d":"2,115.00"},{"v":0.275,"d":"27.50%"},423.08,{"v":2115,"d":"2,115.00"},{"v":0.275,"d":"27.50%"},423.08,{"v":2115,"d":"2,115.00"},{"v":0.275,"d":"27.50%"},423.08,{"v":106,"d":"106.00"}]
["2003-10-01",{"v":0,"d":"0.00%"},0,{"v":1058.01,"d":"1,058.01"},{"v":0.15,"d":"15.00%"},{"v":158.7,"d":"158.70"},{"v":2115,"d":"2,115.00"},{"v":0.275,"d":"27.50%"},423.08,{"v":2115,"d":"2,115.00"},{"v":0.275,"d":"27.50%"},423.08,{"v":2115,"d":"2,115.00"},{"v":0.275,"d":"27.50%"},423.08,{"v":106,"d":"106.00"}]
["2003-11-01",{"v":0,"d":"0.00%"},0,{"v":1058.01,"d":"1,058.01"},{"v":0.15,"d":"15.00%"},{"v":158.7,"d":"158.70"},{"v":2115,"d":"2,115.00"},{"v":0.275,"d":"27.50%"},423.08,{"v":2115,"d":"2,115.00"},{"v":0.275,"d":"27.50%"},423.08,{"v":2115,"d":"2,115.00"},{"v":0.275,"d":"27.50%"},423.08,{"v":106,"d":"106.00"}]
["2003-12-01",{"v":0,"d":"0.00%"},0,{"v":1058.01,"d":"1,058.01"},{"v":0.15,"d":"15.00%"},{"v":158.7,"d":"158.70"},{"v":2115,"d":"2,115.00"},{"v":0.275,"d":"27.50%"},423.08,{"v":2115,"d":"2,115.00"},{"v":0.275,"d":"27.50%"},423.08,{"v":2115,"d":"2,115.00"},{"v":0.275,"d":"27.50%"},423.08,{"v":106,"d":"106.00"}]
["2004-01-01",{"v":0,"d":"0.00%"},0,{"v":1058.01,"d":"1,058.01"},{"v":0.15,"d":"15.00%"},{"v":158.7,"d":"158.70"},{"v":2115,"d":"2,115.00"},{"v":0.275,"d":"27.50%"},423.08,{"v":2115,"d":"2,115.00"},{"v":0.275,"d":"27.50%"},423.08,{"v":2115,"d":"2,115.00"},{"v":0.275,"d":"27.50%"},423.08,{"v":106,"d":"106.00"}]
["2004-02-01",{"v":0,"d":"0.00%"},0,{"v":1058.01,"d":"1,058.01"},{"v":0.15,"d":"15.00%"},{"v":158.7,"d":"158.70"},{"v":2115,"d":"2,115.00"},{"v":0.275,"d":"27.50%"},423.08,{"v":2115,"d":"2,115.00"},{"v":0.275,"d":"27.50%"},423.08,{"v":2115,"d":"2,115.00"},{"v":0.275,"d":"27.50%"},423.08,{"v":106,"d":"106.00"}]
["2004-03-01",{"v":0,"d":"0.00%"},0,{"v":1058.01,"d":"1,058.01"},{"v":0.15,"d":"15.00%"},{"v":158.7,"d":"158.70"},{"v":2115,"d":"2,115.00"},{"v":0.275,"d":"27.50%"},423.08,{"v":2115,"d":"2,115.00"},{"v":0.275,"d":"27.50%"},423.08,{"v":2115,"d":"2,115.00"},{"v":0.275,"d":"27.50%"},423.08,{"v":106,"d":"106.00"}]
["2004-04-01",{"v":0,"d":"0.00%"},0,{"v":1058.01,"d":"1,058.01"},{"v":0.15,"d":"15.00%"},{"v":158.7,"d":"158.70"},{"v":2115,"d":"2,115.00"},{"v":0.275,"d":"27.50%"},423.08,{"v":2115,"d":"2,115.00"},{"v":0.275,"d":"27.50%"},423.08,{"v":2115,"d":"2,115.00"},{"v":0.275,"d":"27.50%"},423.08,{"v":106,"d":"106.00"}]
["2004-05-01",{"v":0,"d":"0.00%"},0,{"v":1058.01,"d":"1,058.01"},{"v":0.15,"d":"15.00%"},{"v":158.7,"d":"158.70"},{"v":2115,"d":"2,115.00"},{"v":0.275,"d":"27.50%"},423.08,{"v":2115,"d":"2,115.00"},{"v":0.275,"d":"27.50%"},423.08,{"v":2115,"d":"2,115.00"},{"v":0.275,"d":"27.50%"},423.08,{"v":106,"d":"106.00"}]
["2004-06-01",{"v":0,"d":"0.00%"},0,{"v":1058.01,"d":"1,058.01"},{"v":0.15,"d":"15.00%"},{"v":158.7,"d":"158.70"},{"v":2115,"d":"2,115.00"},{"v":0.275,"d":"27.50%"},423.08,{"v":2115,"d":"2,115.00"},{"v":0.275,"d":"27.50%"},423.08,{"v":2115,"d":"2,115.00"},{"v":0.275,"d":"27.50%"},423.08,{"v":106,"d":"106.00"}]
["2004-07-01",{"v":0,"d":"0.00%"},0,{"v":1058.01,"d":"1,058.01"},{"v":0.15,"d":"15.00%"},{"v":158.7,"d":"158.70"},{"v":2115,"d":"2,115.00"},{"v":0.275,"d":"27.50%"},423.08,{"v":2115,"d":"2,115.00"},{"v":0.275,"d":"27.50%"},423.08,{"v":2115,"d":"2,115.00"},{"v":0.275,"d":"27.50%"},423.08,{"v":106,"d":"106.00"}]
["2004-08-01",{"v":0,"d":"0.00%"},0,{"v":1058.01,"d":"1,058.01"},{"v":0.15,"d":"15.00%"},{"v":158.7,"d":"158.70"},{"v":2115,"d":"2,115.00"},{"v":0.275,"d":"27.50%"},423.08,{"v":2115,"d":"2,115.00"},{"v":0.275,"d":"27.50%"},423.08,{"v":2115,"d":"2,115.00"},{"v":0.275,"d":"27.50%"},423.08,{"v":106,"d":"106.00"},{"v":100,"d":"100.00"}]
["2004-09-01",{"v":0,"d":"0.00%"},0,{"v":1058.01,"d":"1,058.01"},{"v":0.15,"d":"15.00%"},{"v":158.7,"d":"158.70"},{"v":2115,"d":"2,115.00"},{"v":0.275,"d":"27.50%"},423.08,{"v":2115,"d":"2,115.00"},{"v":0.275,"d":"27.50%"},423.08,{"v":2115,"d":"2,115.00"},{"v":0.275,"d":"27.50%"},423.08,{"v":106,"d":"106.00"},{"v":100,"d":"100.00"}]
["2004-10-01",{"v":0,"d":"0.00%"},0,{"v":1058.01,"d":"1,058.01"},{"v":0.15,"d":"15.00%"},{"v":158.7,"d":"158.70"},{"v":2115,"d":"2,115.00"},{"v":0.275,"d":"27.50%"},423.08,{"v":2115,"d":"2,115.00"},{"v":0.275,"d":"27.50%"},423.08,{"v":2115,"d":"2,115.00"},{"v":0.275,"d":"27.50%"},423.08,{"v":106,"d":"106.00"},{"v":100,"d":"100.00"}]
["2004-11-01",{"v":0,"d":"0.00%"},0,{"v":1058.01,"d":"1,058.01"},{"v":0.15,"d":"15.00%"},{"v":158.7,"d":"158.70"},{"v":2115,"d":"2,115.00"},{"v":0.275,"d":"27.50%"},423.08,{"v":2115,"d":"2,115.00"},{"v":0.275,"d":"27.50%"},423.08,{"v":2115,"d":"2,115.00"},{"v":0.275,"d":"27.50%"},423.08,{"v":106,"d":"106.00"},{"v":100,"d":"100.00"}]
["2004-12-01",{"v":0,"d":"0.00%"},0,{"v":1058.01,"d":"1,058.01"},{"v":0.15,"d":"15.00%"},{"v":158.7,"d":"158.70"},{"v":2115,"d":"2,115.00"},{"v":0.275,"d":"27.50%"},423.08,{"v":2115,"d":"2,115.00"},{"v":0.275,"d":"27.50%"},423.08,{"v":2115,"d":"2,115.00"},{"v":0.275,"d":"27.50%"},423.08,{"v":106,"d":"106.00"},{"v":100,"d":"100.00"}]
["2005-01-01",{"v":0,"d":"0.00%"},0,{"v":1164,"d":"1,164.00"},{"v":0.15,"d":"15.00%"},{"v":174.6,"d":"174.60"},{"v":2326,"d":"2,326.00"},{"v":0.275,"d":"27.50%"},465.35,{"v":2326,"d":"2,326.00"},{"v":0.275,"d":"27.50%"},465.35,{"v":2326,"d":"2,326.00"},{"v":0.275,"d":"27.50%"},465.35,{"v":117,"d":"117.00"}]
["2005-02-01",{"v":0,"d":"0.00%"},0,{"v":1164,"d":"1,164.00"},{"v":0.15,"d":"15.00%"},{"v":174.6,"d":"174.60"},{"v":2326,"d":"2,326.00"},{"v":0.275,"d":"27.50%"},465.35,{"v":2326,"d":"2,326.00"},{"v":0.275,"d":"27.50%"},465.35,{"v":2326,"d":"2,326.00"},{"v":0.275,"d":"27.50%"},465.35,{"v":117,"d":"117.00"}]
["2005-03-01",{"v":0,"d":"0.00%"},0,{"v":1164,"d":"1,164.00"},{"v":0.15,"d":"15.00%"},{"v":174.6,"d":"174.60"},{"v":2326,"d":"2,326.00"},{"v":0.275,"d":"27.50%"},465.35,{"v":2326,"d":"2,326.00"},{"v":0.275,"d":"27.50%"},465.35,{"v":2326,"d":"2,326.00"},{"v":0.275,"d":"27.50%"},465.35,{"v":117,"d":"117.00"}]
["2005-04-01",{"v":0,"d":"0.00%"},0,{"v":1164,"d":"1,164.00"},{"v":0.15,"d":"15.00%"},{"v":174.6,"d":"174.60"},{"v":2326,"d":"2,326.00"},{"v":0.275,"d":"27.50%"},465.35,{"v":2326,"d":"2,326.00"},{"v":0.275,"d":"27.50%"},465.35,{"v":2326,"d":"2,326.00"},{"v":0.275,"d":"27.50%"},465.35,{"v":117,"d":"117.00"}]
["2005-05-01",{"v":0,"d":"0.00%"},0,{"v":1164,"d":"1,164.00"},{"v":0.15,"d":"15.00%"},{"v":174.6,"d":"174.60"},{"v":2326,"d":"2,326.00"},{"v":0.275,"d":"27.50%"},465.35,{"v":2326,"d":"2,326.00"},{"v":0.275,"d":"27.50%"},465.35,{"v":2326,"d":"2,326.00"},{"v":0.275,"d":"27.50%"},465.35,{"v":117,"d":"117.00"}]
["2005-06-01",{"v":0,"d":"0.00%"},0,{"v":1164,"d":"1,164.00"},{"v":0.15,"d":"15.00%"},{"v":174.6,"d":"174.60"},{"v":2326,"d":"2,326.00"},{"v":0.275,"d":"27.50%"},465.35,{"v":2326,"d":"2,326.00"},{"v":0.275,"d":"27.50%"},465.35,{"v":2326,"d":"2,326.00"},{"v":0.275,"d":"27.50%"},465.35,{"v":117,"d":"117.00"}]
["2005-07-01",{"v":0,"d":"0.00%"},0,{"v":1164,"d":"1,164.00"},{"v":0.15,"d":"15.00%"},{"v":174.6,"d":"174.60"},{"v":2326,"d":"2,326.00"},{"v":0.275,"d":"27.50%"},465.35,{"v":2326,"d":"2,326.00"},{"v":0.275,"d":"27.50%"},465.35,{"v":2326,"d":"2,326.00"},{"v":0.275,"d":"27.50%"},465.35,{"v":117,"d":"117.00"}]
["2005-08-01",{"v":0,"d":"0.00%"},0,{"v":1164,"d":"1,164.00"},{"v":0.15,"d":"15.00%"},{"v":174.6,"d":"174.60"},{"v":2326,"d":"2,326.00"},{"v":0.275,"d":"27.50%"},465.35,{"v":2326,"d":"2,326.00"},{"v":0.275,"d":"27.50%"},465.35,{"v":2326,"d":"2,326.00"},{"v":0.275,"d":"27.50%"},465.35,{"v":117,"d":"117.00"}]
["2005-09-01",{"v":0,"d":"0.00%"},0,{"v":1164,"d":"1,164.00"},{"v":0.15,"d":"15.00%"},{"v":174.6,"d":"174.60"},{"v":2326,"d":"2,326.00"},{"v":0.275,"d":"27.50%"},465.35,{"v":2326,"d":"2,326.00"},{"v":0.275,"d":"27.50%"},465.35,{"v":2326,"d":"2,326.00"},{"v":0.275,"d":"27.50%"},465.35,{"v":117,"d":"117.00"}]
["2005-10-01",{"v":0,"d":"0.00%"},0,{"v":1164,"d":"1,164.00"},{"v":0.15,"d":"15.00%"},{"v":174.6,"d":"174.60"},{"v":2326,"d":"2,326.00"},{"v":0.275,"d":"27.50%"},465.35,{"v":2326,"d":"2,326.00"},{"v":0.275,"d":"27.50%"},465.35,{"v":2326,"d":"2,326.00"},{"v":0.275,"d":"27.50%"},465.35,{"v":117,"d":"117.00"}]
["2005-11-01",{"v":0,"d":"0.00%"},0,{"v":1164,"d":"1,164.00"},{"v":0.15,"d":"15.00%"},{"v":174.6,"d":"174.60"},{"v":2326,"d":"2,326.00"},{"v":0.275,"d":"27.50%"},465.35,{"v":2326,"d":"2,326.00"},{"v":0.275,"d":"27.50%"},465.35,{"v":2326,"d":"2,326.00"},{"v":0.275,"d":"27.50%"},465.35,{"v":117,"d":"117.00"}]
["2005-12-01",{"v":0,"d":"0.00%"},0,{"v":1164,"d":"1,164.00"},{"v":0.15,"d":"15.00%"},{"v":174.6,"d":"174.60"},{"v":2326,"d":"2,326.00"},{"v":0.275,"d":"27.50%"},465.35,{"v":2326,"d":"2,326.00"},{"v":0.275,"d":"27.50%"},465.35,{"v":2326,"d":"2,326.00"},{"v":0.275,"d":"27.50%"},465.35,{"v":117,"d":"117.00"}]
["2006-01-01",{"v":0,"d":"0.00%"},0,{"v":1164,"d":"1,164.00"},{"v":0.15,"d":"15.00%"},{"v":174.6,"d":"174.60"},{"v":2326,"d":"2,326.00"},{"v":0.275,"d":"27.50%"},465.35,{"v":2326,"d":"2,326.00"},{"v":0.275,"d":"27.50%"},465.35,{"v":2326,"d":"2,326.00"},{"v":0.275,"d":"27.50%"},465.35,{"v":117,"d":"117.00"}]
["2006-02-01",{"v":0,"d":"0.00%"},0,{"v":1257.12,"d":"1,257.12"},{"v":0.15,"d":"15.00%"},188.57,{"v":2512.08,"d":"2,512.08"},{"v":0.275,"d":"27.50%"},502.58,{"v":2512.08,"d":"2,512.08"},{"v":0.275,"d":"27.50%"},502.58,{"v":2512.08,"d":"2,512.08"},{"v":0.275,"d":"27.50%"},502.58,126.36]
["2006-03-01",{"v":0,"d":"0.00%"},0,{"v":1257.12,"d":"1,257.12"},{"v":0.15,"d":"15.00%"},188.57,{"v":2512.08,"d":"2,512.08"},{"v":0.275,"d":"27.50%"},502.58,{"v":2512.08,"d":"2,512.08"},{"v":0.275,"d":"27.50%"},502.58,{"v":2512.08,"d":"2,512.08"},{"v":0.275,"d":"27.50%"},502.58,126.36]
["2006-04-01",{"v":0,"d":"0.00%"},0,{"v":1257.12,"d":"1,257.12"},{"v":0.15,"d":"15.00%"},188.57,{"v":2512.08,"d":"2,512.08"},{"v":0.275,"d":"27.50%"},502.58,{"v":2512.08,"d":"2,512.08"},{"v":0.275,"d":"27.50%"},502.58,{"v":2512.08,"d":"2,512.08"},{"v":0.275,"d":"27.50%"},502.58,126.36]
["2006-05-01",{"v":0,"d":"0.00%"},0,{"v":1257.12,"d":"1,257.12"},{"v":0.15,"d":"15.00%"},188.57,{"v":2512.08,"d":"2,512.08"},{"v":0.275,"d":"27.50%"},502.58,{"v":2512.08,"d":"2,512.08"},{"v":0.275,"d":"27.50%"},502.58,{"v":2512.08,"d":"2,512.08"},{"v":0.275,"d":"27.50%"},502.58,126.36]
["2006-06-01",{"v":0,"d":"0.00%"},0,{"v":1257.12,"d":"1,257.12"},{"v":0.15,"d":"15.00%"},188.57,{"v":2512.08,"d":"2,512.08"},{"v":0.275,"d":"27.50%"},502.58,{"v":2512.08,"d":"2,512.08"},{"v":0.275,"d":"27.50%"},502.58,{"v":2512.08,"d":"2,512.08"},{"v":0.275,"d":"27.50%"},502.58,126.36]
["2006-07-01",{"v":0,"d":"0.00%"},0,{"v":1257.12,"d":"1,257.12"},{"v":0.15,"d":"15.00%"},188.57,{"v":2512.08,"d":"2,512.08"},{"v":0.275,"d":"27.50%"},502.58,{"v":2512.08,"d":"2,512.08"},{"v":0.275,"d":"27.50%"},502.58,{"v":2512.08,"d":"2,512.08"},{"v":0.275,"d":"27.50%"},502.58,126.36]
["2006-08-01",{"v":0,"d":"0.00%"},0,{"v":1257.12,"d":"1,257.12"},{"v":0.15,"d":"15.00%"},188.57,{"v":2512.08,"d":"2,512.08"},{"v":0.275,"d":"27.50%"},502.58,{"v":2512.08,"d":"2,512.08"},{"v":0.275,"d":"27.50%"},502.58,{"v":2512.08,"d":"2,512.08"},{"v":0.275,"d":"27.50%"},502.58,126.36]
["2006-09-01",{"v":0,"d":"0.00%"},0,{"v":1257.12,"d":"1,257.12"},{"v":0.15,"d":"15.00%"},188.57,{"v":2512.08,"d":"2,512.08"},{"v":0.275,"d":"27.50%"},502.58,{"v":2512.08,"d":"2,512.08"},{"v":0.275,"d":"27.50%"},502.58,{"v":2512.08,"d":"2,512.08"},{"v":0.275,"d":"27.50%"},502.58,126.36]
["2006-10-01",{"v":0,"d":"0.00%"},0,{"v":1257.12,"d":"1,257.12"},{"v":0.15,"d":"15.00%"},188.57,{"v":2512.08,"d":"2,512.08"},{"v":0.275,"d":"27.50%"},502.58,{"v":2512.08,"d":"2,512.08"},{"v":0.275,"d":"27.50%"},502.58,{"v":2512.08,"d":"2,512.08"},{"v":0.275,"d":"27.50%"},502.58,126.36]
["2006-11-01",{"v":0,"d":"0.00%"},0,{"v":1257.12,"d":"1,257.12"},{"v":0.15,"d":"15.00%"},188.57,{"v":2512.08,"d":"2,512.08"},{"v":0.275,"d":"27.50%"},502.58,{"v":2512.08,"d":"2,512.08"},{"v":0.275,"d":"27.50%"},502.58,{"v":2512.08,"d":"2,512.08"},{"v":0.275,"d":"27.50%"},502.58,126.36]
["2006-12-01",{"v":0,"d":"0.00%"},0,{"v":1257.12,"d":"1,257.12"},{"v":0.15,"d":"15.00%"},188.57,{"v":2512.08,"d":"2,512.08"},{"v":0.275,"d":"27.50%"},502.58,{"v":2512.08,"d":"2,512.08"},{"v":0.275,"d":"27.50%"},502.58,{"v":2512.08,"d":"2,512.08"},{"v":0.275,"d":"27.50%"},502.58,126.36]
["2007-01-01",{"v":0,"d":"0.00%"},0,{"v":1313.69,"d":"1,313.69"},{"v":0.15,"d":"15.00%"},197.05,{"v":2625.12,"d":"2,625.12"},{"v":0.275,"d":"27.50%"},525.19,{"v":2625.12,"d":"2,625.12"},{"v":0.275,"d":"27.50%"},525.19,{"v":2625.12,"d":"2,625.12"},{"v":0.275,"d":"27.50%"},525.19,132.05]
["2007-02-01",{"v":0,"d":"0.00%"},0,{"v":1313.69,"d":"1,313.69"},{"v":0.15,"d":"15.00%"},197.05,{"v":2625.12,"d":"2,625.12"},{"v":0.275,"d":"27.50%"},525.19,{"v":2625.12,"d":"2,625.12"},{"v":0.275,"d":"27.50%"},525.19,{"v":2625.12,"d":"2,625.12"},{"v":0.275,"d":"27.50%"},525.19,132.05]
["2007-03-01",{"v":0,"d":"0.00%"},0,{"v":1313.69,"d":"1,313.69"},{"v":0.15,"d":"15.00%"},197.05,{"v":2625.12,"d":"2,625.12"},{"v":0.275,"d":"27.50%"},525.19,{"v":2625.12,"d":"2,625.12"},{"v":0.275,"d":"27.50%"},525.19,{"$f":"J198","v":{"v":2625.12,"d":"2,625.12"}},{"v":0.275,"d":"27.50%"},525.19,132.05]
["2007-04-01",{"v":0,"d":"0.00%"},0,{"v":1313.69,"d":"1,313.69"},{"v":0.15,"d":"15.00%"},197.05,{"v":2625.12,"d":"2,625.12"},{"v":0.275,"d":"27.50%"},525.19,{"v":2625.12,"d":"2,625.12"},{"v":0.275,"d":"27.50%"},525.19,{"v":2625.12,"d":"2,625.12"},{"v":0.275,"d":"27.50%"},525.19,132.05]
["2007-05-01",{"v":0,"d":"0.00%"},0,{"v":1313.69,"d":"1,313.69"},{"v":0.15,"d":"15.00%"},197.05,{"v":2625.12,"d":"2,625.12"},{"v":0.275,"d":"27.50%"},525.19,{"v":2625.12,"d":"2,625.12"},{"v":0.275,"d":"27.50%"},525.19,{"v":2625.12,"d":"2,625.12"},{"v":0.275,"d":"27.50%"},525.19,132.05]
["2007-06-01",{"v":0,"d":"0.00%"},0,{"v":1313.69,"d":"1,313.69"},{"v":0.15,"d":"15.00%"},197.05,{"v":2625.12,"d":"2,625.12"},{"v":0.275,"d":"27.50%"},525.19,{"v":2625.12,"d":"2,625.12"},{"v":0.275,"d":"27.50%"},525.19,{"v":2625.12,"d":"2,625.12"},{"v":0.275,"d":"27.50%"},525.19,132.05]
["2007-07-01",{"v":0,"d":"0.00%"},0,{"v":1313.69,"d":"1,313.69"},{"v":0.15,"d":"15.00%"},197.05,{"v":2625.12,"d":"2,625.12"},{"v":0.275,"d":"27.50%"},525.19,{"v":2625.12,"d":"2,625.12"},{"v":0.275,"d":"27.50%"},525.19,{"v":2625.12,"d":"2,625.12"},{"v":0.275,"d":"27.50%"},525.19,132.05]
["2007-08-01",{"v":0,"d":"0.00%"},0,{"v":1313.69,"d":"1,313.69"},{"v":0.15,"d":"15.00%"},197.05,{"v":2625.12,"d":"2,625.12"},{"v":0.275,"d":"27.50%"},525.19,{"v":2625.12,"d":"2,625.12"},{"v":0.275,"d":"27.50%"},525.19,{"v":2625.12,"d":"2,625.12"},{"v":0.275,"d":"27.50%"},525.19,132.05]
["2007-09-01",{"v":0,"d":"0.00%"},0,{"v":1313.69,"d":"1,313.69"},{"v":0.15,"d":"15.00%"},197.05,{"v":2625.12,"d":"2,625.12"},{"v":0.275,"d":"27.50%"},525.19,{"v":2625.12,"d":"2,625.12"},{"v":0.275,"d":"27.50%"},525.19,{"v":2625.12,"d":"2,625.12"},{"v":0.275,"d":"27.50%"},525.19,132.05]
["2007-10-01",{"v":0,"d":"0.00%"},0,{"v":1313.69,"d":"1,313.69"},{"v":0.15,"d":"15.00%"},197.05,{"v":2625.12,"d":"2,625.12"},{"v":0.275,"d":"27.50%"},525.19,{"v":2625.12,"d":"2,625.12"},{"v":0.275,"d":"27.50%"},525.19,{"v":2625.12,"d":"2,625.12"},{"v":0.275,"d":"27.50%"},525.19,132.05]
["2007-11-01",{"v":0,"d":"0.00%"},0,{"v":1313.69,"d":"1,313.69"},{"v":0.15,"d":"15.00%"},197.05,{"v":2625.12,"d":"2,625.12"},{"v":0.275,"d":"27.50%"},525.19,{"v":2625.12,"d":"2,625.12"},{"v":0.275,"d":"27.50%"},525.19,{"v":2625.12,"d":"2,625.12"},{"v":0.275,"d":"27.50%"},525.19,132.05]
["2007-12-01",{"v":0,"d":"0.00%"},0,{"v":1313.69,"d":"1,313.69"},{"v":0.15,"d":"15.00%"},197.05,{"v":2625.12,"d":"2,625.12"},{"v":0.275,"d":"27.50%"},525.19,{"v":2625.12,"d":"2,625.12"},{"v":0.275,"d":"27.50%"},525.19,{"v":2625.12,"d":"2,625.12"},{"v":0.275,"d":"27.50%"},525.19,132.05]
["2008-01-01",{"v":0,"d":"0.00%"},0,{"v":1372.91,"d":"1,372.91"},{"v":0.15,"d":"15.00%"},205.92,{"v":2743.25,"d":"2,743.25"},{"v":0.275,"d":"27.50%"},548.82,{"v":2743.25,"d":"2,743.25"},{"v":0.275,"d":"27.50%"},548.82,{"v":2743.25,"d":"2,743.25"},{"v":0.275,"d":"27.50%"},548.82,137.99]
["2008-02-01",{"v":0,"d":"0.00%"},0,{"v":1372.91,"d":"1,372.91"},{"v":0.15,"d":"15.00%"},205.92,{"v":2743.25,"d":"2,743.25"},{"v":0.275,"d":"27.50%"},548.82,{"v":2743.25,"d":"2,743.25"},{"v":0.275,"d":"27.50%"},548.82,{"v":2743.25,"d":"2,743.25"},{"v":0.275,"d":"27.50%"},548.82,137.99]
["2008-03-01",{"v":0,"d":"0.00%"},0,{"v":1372.91,"d":"1,372.91"},{"v":0.15,"d":"15.00%"},205.92,{"v":2743.25,"d":"2,743.25"},{"v":0.275,"d":"27.50%"},548.82,{"v":2743.25,"d":"2,743.25"},{"v":0.275,"d":"27.50%"},548.82,{"v":2743.25,"d":"2,743.25"},{"v":0.275,"d":"27.50%"},548.82,137.99]
["2008-04-01",{"v":0,"d":"0.00%"},0,{"v":1372.91,"d":"1,372.91"},{"v":0.15,"d":"15.00%"},205.92,{"v":2743.25,"d":"2,743.25"},{"v":0.275,"d":"27.50%"},548.82,{"v":2743.25,"d":"2,743.25"},{"v":0.275,"d":"27.50%"},548.82,{"v":2743.25,"d":"2,743.25"},{"v":0.275,"d":"27.50%"},548.82,137.99]
["2008-05-01",{"v":0,"d":"0.00%"},0,{"v":1372.91,"d":"1,372.91"},{"v":0.15,"d":"15.00%"},205.92,{"v":2743.25,"d":"2,743.25"},{"v":0.275,"d":"27.50%"},548.82,{"v":2743.25,"d":"2,743.25"},{"v":0.275,"d":"27.50%"},548.82,{"v":2743.25,"d":"2,743.25"},{"v":0.275,"d":"27.50%"},548.82,137.99]
["2008-06-01",{"v":0,"d":"0.00%"},0,{"v":1372.91,"d":"1,372.91"},{"v":0.15,"d":"15.00%"},205.92,{"v":2743.25,"d":"2,743.25"},{"v":0.275,"d":"27.50%"},548.82,{"v":2743.25,"d":"2,743.25"},{"v":0.275,"d":"27.50%"},548.82,{"v":2743.25,"d":"2,743.25"},{"v":0.275,"d":"27.50%"},548.82,137.99]
["2008-07-01",{"v":0,"d":"0.00%"},0,{"v":1372.91,"d":"1,372.91"},{"v":0.15,"d":"15.00%"},205.92,{"v":2743.25,"d":"2,743.25"},{"v":0.275,"d":"27.50%"},548.82,{"v":2743.25,"d":"2,743.25"},{"v":0.275,"d":"27.50%"},548.82,{"v":2743.25,"d":"2,743.25"},{"v":0.275,"d":"27.50%"},548.82,137.99]
["2008-08-01",{"v":0,"d":"0.00%"},0,{"v":1372.91,"d":"1,372.91"},{"v":0.15,"d":"15.00%"},205.92,{"v":2743.25,"d":"2,743.25"},{"v":0.275,"d":"27.50%"},548.82,{"v":2743.25,"d":"2,743.25"},{"v":0.275,"d":"27.50%"},548.82,{"v":2743.25,"d":"2,743.25"},{"v":0.275,"d":"27.50%"},548.82,137.99]
["2008-09-01",{"v":0,"d":"0.00%"},0,{"v":1372.91,"d":"1,372.91"},{"v":0.15,"d":"15.00%"},205.92,{"v":2743.25,"d":"2,743.25"},{"v":0.275,"d":"27.50%"},548.82,{"v":2743.25,"d":"2,743.25"},{"v":0.275,"d":"27.50%"},548.82,{"v":2743.25,"d":"2,743.25"},{"v":0.275,"d":"27.50%"},548.82,137.99]
["2008-10-01",{"v":0,"d":"0.00%"},0,{"v":1372.91,"d":"1,372.91"},{"v":0.15,"d":"15.00%"},205.92,{"v":2743.25,"d":"2,743.25"},{"v":0.275,"d":"27.50%"},548.82,{"v":2743.25,"d":"2,743.25"},{"v":0.275,"d":"27.50%"},548.82,{"v":2743.25,"d":"2,743.25"},{"v":0.275,"d":"27.50%"},548.82,137.99]
["2008-11-01",{"v":0,"d":"0.00%"},0,{"v":1372.91,"d":"1,372.91"},{"v":0.15,"d":"15.00%"},205.92,{"v":2743.25,"d":"2,743.25"},{"v":0.275,"d":"27.50%"},548.82,{"v":2743.25,"d":"2,743.25"},{"v":0.275,"d":"27.50%"},548.82,{"v":2743.25,"d":"2,743.25"},{"v":0.275,"d":"27.50%"},548.82,137.99]
["2008-12-01",{"v":0,"d":"0.00%"},0,{"v":1372.91,"d":"1,372.91"},{"v":0.15,"d":"15.00%"},205.92,{"v":2743.25,"d":"2,743.25"},{"v":0.275,"d":"27.50%"},548.82,{"v":2743.25,"d":"2,743.25"},{"v":0.275,"d":"27.50%"},548.82,{"v":2743.25,"d":"2,743.25"},{"v":0.275,"d":"27.50%"},548.82,137.99]
["2009-01-01",{"v":0,"d":"0.00%"},0,{"v":1434.59,"d":"1,434.59"},{"v":0.075,"d":"7.50%"},107.59,{"v":2150,"d":"2,150.00"},{"v":0.15,"d":"15.00%"},268.84,{"v":2866.7,"d":"2,866.70"},{"v":0.225,"d":"22.50%"},483.84,{"v":3582,"d":"3,582.00"},{"v":0.275,"d":"27.50%"},662.94,{"v":144.2,"d":"144.20"}]
["2009-02-01",{"v":0,"d":"0.00%"},0,{"v":1434.59,"d":"1,434.59"},{"v":0.075,"d":"7.50%"},107.59,{"v":2150,"d":"2,150.00"},{"v":0.15,"d":"15.00%"},268.84,{"v":2866.7,"d":"2,866.70"},{"v":0.225,"d":"22.50%"},483.84,{"v":3582,"d":"3,582.00"},{"v":0.275,"d":"27.50%"},662.94,{"v":144.2,"d":"144.20"}]
["2009-03-01",{"v":0,"d":"0.00%"},0,{"v":1434.59,"d":"1,434.59"},{"v":0.075,"d":"7.50%"},107.59,{"v":2150,"d":"2,150.00"},{"v":0.15,"d":"15.00%"},268.84,{"v":2866.7,"d":"2,866.70"},{"v":0.225,"d":"22.50%"},483.84,{"v":3582,"d":"3,582.00"},{"v":0.275,"d":"27.50%"},662.94,{"v":144.2,"d":"144.20"}]
["2009-04-01",{"v":0,"d":"0.00%"},0,{"v":1434.59,"d":"1,434.59"},{"v":0.075,"d":"7.50%"},107.59,{"v":2150,"d":"2,150.00"},{"v":0.15,"d":"15.00%"},268.84,{"v":2866.7,"d":"2,866.70"},{"v":0.225,"d":"22.50%"},483.84,{"v":3582,"d":"3,582.00"},{"v":0.275,"d":"27.50%"},662.94,{"v":144.2,"d":"144.20"}]
["2009-05-01",{"v":0,"d":"0.00%"},0,{"v":1434.59,"d":"1,434.59"},{"v":0.075,"d":"7.50%"},107.59,{"v":2150,"d":"2,150.00"},{"v":0.15,"d":"15.00%"},268.84,{"v":2866.7,"d":"2,866.70"},{"v":0.225,"d":"22.50%"},483.84,{"v":3582,"d":"3,582.00"},{"v":0.275,"d":"27.50%"},662.94,{"v":144.2,"d":"144.20"}]
["2009-06-01",{"v":0,"d":"0.00%"},0,{"v":1434.59,"d":"1,434.59"},{"v":0.075,"d":"7.50%"},107.59,{"v":2150,"d":"2,150.00"},{"v":0.15,"d":"15.00%"},268.84,{"v":2866.7,"d":"2,866.70"},{"v":0.225,"d":"22.50%"},483.84,{"v":3582,"d":"3,582.00"},{"v":0.275,"d":"27.50%"},662.94,{"v":144.2,"d":"144.20"}]
["2009-07-01",{"v":0,"d":"0.00%"},0,{"v":1434.59,"d":"1,434.59"},{"v":0.075,"d":"7.50%"},107.59,{"v":2150,"d":"2,150.00"},{"v":0.15,"d":"15.00%"},268.84,{"v":2866.7,"d":"2,866.70"},{"v":0.225,"d":"22.50%"},483.84,{"v":3582,"d":"3,582.00"},{"v":0.275,"d":"27.50%"},662.94,{"v":144.2,"d":"144.20"}]
["2009-08-01",{"v":0,"d":"0.00%"},0,{"v":1434.59,"d":"1,434.59"},{"v":0.075,"d":"7.50%"},107.59,{"v":2150,"d":"2,150.00"},{"v":0.15,"d":"15.00%"},268.84,{"v":2866.7,"d":"2,866.70"},{"v":0.225,"d":"22.50%"},483.84,{"v":3582,"d":"3,582.00"},{"v":0.275,"d":"27.50%"},662.94,{"v":144.2,"d":"144.20"}]
["2009-09-01",{"v":0,"d":"0.00%"},0,{"v":1434.59,"d":"1,434.59"},{"v":0.075,"d":"7.50%"},107.59,{"v":2150,"d":"2,150.00"},{"v":0.15,"d":"15.00%"},268.84,{"v":2866.7,"d":"2,866.70"},{"v":0.225,"d":"22.50%"},483.84,{"v":3582,"d":"3,582.00"},{"v":0.275,"d":"27.50%"},662.94,{"v":144.2,"d":"144.20"}]
["2009-10-01",{"v":0,"d":"0.00%"},0,{"v":1434.59,"d":"1,434.59"},{"v":0.075,"d":"7.50%"},107.59,{"v":2150,"d":"2,150.00"},{"v":0.15,"d":"15.00%"},268.84,{"v":2866.7,"d":"2,866.70"},{"v":0.225,"d":"22.50%"},483.84,{"v":3582,"d":"3,582.00"},{"v":0.275,"d":"27.50%"},662.94,{"v":144.2,"d":"144.20"}]
["2009-11-01",{"v":0,"d":"0.00%"},0,{"v":1434.59,"d":"1,434.59"},{"v":0.075,"d":"7.50%"},107.59,{"v":2150,"d":"2,150.00"},{"v":0.15,"d":"15.00%"},268.84,{"v":2866.7,"d":"2,866.70"},{"v":0.225,"d":"22.50%"},483.84,{"v":3582,"d":"3,582.00"},{"v":0.275,"d":"27.50%"},662.94,{"v":144.2,"d":"144.20"}]
["2009-12-01",{"v":0,"d":"0.00%"},0,{"v":1434.59,"d":"1,434.59"},{"v":0.075,"d":"7.50%"},107.59,{"v":2150,"d":"2,150.00"},{"v":0.15,"d":"15.00%"},268.84,{"v":2866.7,"d":"2,866.70"},{"v":0.225,"d":"22.50%"},483.84,{"v":3582,"d":"3,582.00"},{"v":0.275,"d":"27.50%"},662.94,{"v":144.2,"d":"144.20"}]
["2010-01-01",{"v":0,"d":"0.00%"},0,{"v":1499.15,"d":"1,499.15"},{"v":0.075,"d":"7.50%"},112.43,{"v":2246.75,"d":"2,246.75"},{"v":0.15,"d":"15.00%"},280.94,{"v":2995.7,"d":"2,995.70"},{"v":0.225,"d":"22.50%"},505.62,{"v":3743.19,"d":"3,743.19"},{"v":0.275,"d":"27.50%"},692.78,150.69]
["2010-02-01",{"v":0,"d":"0.00%"},0,{"v":1499.15,"d":"1,499.15"},{"v":0.075,"d":"7.50%"},112.43,{"v":2246.75,"d":"2,246.75"},{"v":0.15,"d":"15.00%"},280.94,{"v":2995.7,"d":"2,995.70"},{"v":0.225,"d":"22.50%"},505.62,{"v":3743.19,"d":"3,743.19"},{"v":0.275,"d":"27.50%"},692.78,150.69]
["2010-03-01",{"v":0,"d":"0.00%"},0,{"v":1499.15,"d":"1,499.15"},{"v":0.075,"d":"7.50%"},112.43,{"v":2246.75,"d":"2,246.75"},{"v":0.15,"d":"15.00%"},280.94,{"v":2995.7,"d":"2,995.70"},{"v":0.225,"d":"22.50%"},505.62,{"v":3743.19,"d":"3,743.19"},{"v":0.275,"d":"27.50%"},692.78,150.69]
["2010-04-01",{"v":0,"d":"0.00%"},0,{"v":1499.15,"d":"1,499.15"},{"v":0.075,"d":"7.50%"},112.43,{"v":2246.75,"d":"2,246.75"},{"v":0.15,"d":"15.00%"},280.94,{"v":2995.7,"d":"2,995.70"},{"v":0.225,"d":"22.50%"},505.62,{"v":3743.19,"d":"3,743.19"},{"v":0.275,"d":"27.50%"},692.78,150.69]
["2010-05-01",{"v":0,"d":"0.00%"},0,{"v":1499.15,"d":"1,499.15"},{"v":0.075,"d":"7.50%"},112.43,{"v":2246.75,"d":"2,246.75"},{"v":0.15,"d":"15.00%"},280.94,{"v":2995.7,"d":"2,995.70"},{"v":0.225,"d":"22.50%"},505.62,{"v":3743.19,"d":"3,743.19"},{"v":0.275,"d":"27.50%"},692.78,150.69]
["2010-06-01",{"v":0,"d":"0.00%"},0,{"v":1499.15,"d":"1,499.15"},{"v":0.075,"d":"7.50%"},112.43,{"v":2246.75,"d":"2,246.75"},{"v":0.15,"d":"15.00%"},280.94,{"v":2995.7,"d":"2,995.70"},{"v":0.225,"d":"22.50%"},505.62,{"v":3743.19,"d":"3,743.19"},{"v":0.275,"d":"27.50%"},692.78,150.69]
["2010-07-01",{"v":0,"d":"0.00%"},0,{"v":1499.15,"d":"1,499.15"},{"v":0.075,"d":"7.50%"},112.43,{"v":2246.75,"d":"2,246.75"},{"v":0.15,"d":"15.00%"},280.94,{"v":2995.7,"d":"2,995.70"},{"v":0.225,"d":"22.50%"},505.62,{"v":3743.19,"d":"3,743.19"},{"v":0.275,"d":"27.50%"},692.78,150.69]
["2010-08-01",{"v":0,"d":"0.00%"},0,{"v":1499.15,"d":"1,499.15"},{"v":0.075,"d":"7.50%"},112.43,{"v":2246.75,"d":"2,246.75"},{"v":0.15,"d":"15.00%"},280.94,{"v":2995.7,"d":"2,995.70"},{"v":0.225,"d":"22.50%"},505.62,{"v":3743.19,"d":"3,743.19"},{"v":0.275,"d":"27.50%"},692.78,150.69]
["2010-09-01",{"v":0,"d":"0.00%"},0,{"v":1499.15,"d":"1,499.15"},{"v":0.075,"d":"7.50%"},112.43,{"v":2246.75,"d":"2,246.75"},{"v":0.15,"d":"15.00%"},280.94,{"v":2995.7,"d":"2,995.70"},{"v":0.225,"d":"22.50%"},505.62,{"v":3743.19,"d":"3,743.19"},{"v":0.275,"d":"27.50%"},692.78,150.69]
["2010-10-01",{"v":0,"d":"0.00%"},0,{"v":1499.15,"d":"1,499.15"},{"v":0.075,"d":"7.50%"},112.43,{"v":2246.75,"d":"2,246.75"},{"v":0.15,"d":"15.00%"},280.94,{"v":2995.7,"d":"2,995.70"},{"v":0.225,"d":"22.50%"},505.62,{"v":3743.19,"d":"3,743.19"},{"v":0.275,"d":"27.50%"},692.78,150.69]
["2010-11-01",{"v":0,"d":"0.00%"},0,{"v":1499.15,"d":"1,499.15"},{"v":0.075,"d":"7.50%"},112.43,{"v":2246.75,"d":"2,246.75"},{"v":0.15,"d":"15.00%"},280.94,{"v":2995.7,"d":"2,995.70"},{"v":0.225,"d":"22.50%"},505.62,{"v":3743.19,"d":"3,743.19"},{"v":0.275,"d":"27.50%"},692.78,150.69]
["2010-12-01",{"v":0,"d":"0.00%"},0,{"v":1499.15,"d":"1,499.15"},{"v":0.075,"d":"7.50%"},112.43,{"v":2246.75,"d":"2,246.75"},{"v":0.15,"d":"15.00%"},280.94,{"v":2995.7,"d":"2,995.70"},{"v":0.225,"d":"22.50%"},505.62,{"v":3743.19,"d":"3,743.19"},{"v":0.275,"d":"27.50%"},692.78,150.69]
["2011-01-01",{"v":0,"d":"0.00%"},0,{"v":1499.15,"d":"1,499.15"},{"v":0.075,"d":"7.50%"},112.43,{"v":2246.75,"d":"2,246.75"},{"v":0.15,"d":"15.00%"},280.94,{"v":2995.7,"d":"2,995.70"},{"v":0.225,"d":"22.50%"},505.62,{"v":3743.19,"d":"3,743.19"},{"v":0.275,"d":"27.50%"},692.78,150.69]
["2011-02-01",{"v":0,"d":"0.00%"},0,{"v":1499.15,"d":"1,499.15"},{"v":0.075,"d":"7.50%"},112.43,{"v":2246.75,"d":"2,246.75"},{"v":0.15,"d":"15.00%"},280.94,{"v":2995.7,"d":"2,995.70"},{"v":0.225,"d":"22.50%"},505.62,{"v":3743.19,"d":"3,743.19"},{"v":0.275,"d":"27.50%"},692.78,150.69]
["2011-03-01",{"v":0,"d":"0.00%"},0,{"v":1499.15,"d":"1,499.15"},{"v":0.075,"d":"7.50%"},112.43,{"v":2246.75,"d":"2,246.75"},{"v":0.15,"d":"15.00%"},280.94,{"v":2995.7,"d":"2,995.70"},{"v":0.225,"d":"22.50%"},505.62,{"v":3743.19,"d":"3,743.19"},{"v":0.275,"d":"27.50%"},692.78,150.69]
["2011-04-01",{"v":0,"d":"0.00%"},0,{"v":1566.61,"d":"1,566.61"},{"v":0.075,"d":"7.50%"},117.49,{"v":2347.85,"d":"2,347.85"},{"v":0.15,"d":"15.00%"},293.58,{"v":3130.51,"d":"3,130.51"},{"v":0.225,"d":"22.50%"},528.37,{"v":3911.63,"d":"3,911.63"},{"v":0.275,"d":"27.50%"},723.95,157.47]
["2011-05-01",{"v":0,"d":"0.00%"},0,{"v":1566.61,"d":"1,566.61"},{"v":0.075,"d":"7.50%"},117.49,{"v":2347.85,"d":"2,347.85"},{"v":0.15,"d":"15.00%"},293.58,{"v":3130.51,"d":"3,130.51"},{"v":0.225,"d":"22.50%"},528.37,{"v":3911.63,"d":"3,911.63"},{"v":0.275,"d":"27.50%"},723.95,157.47]
["2011-06-01",{"v":0,"d":"0.00%"},0,{"v":1566.61,"d":"1,566.61"},{"v":0.075,"d":"7.50%"},117.49,{"v":2347.85,"d":"2,347.85"},{"v":0.15,"d":"15.00%"},293.58,{"v":3130.51,"d":"3,130.51"},{"v":0.225,"d":"22.50%"},528.37,{"v":3911.63,"d":"3,911.63"},{"v":0.275,"d":"27.50%"},723.95,157.47]
["2011-07-01",{"v":0,"d":"0.00%"},0,{"v":1566.61,"d":"1,566.61"},{"v":0.075,"d":"7.50%"},117.49,{"v":2347.85,"d":"2,347.85"},{"v":0.15,"d":"15.00%"},293.58,{"v":3130.51,"d":"3,130.51"},{"v":0.225,"d":"22.50%"},528.37,{"v":3911.63,"d":"3,911.63"},{"v":0.275,"d":"27.50%"},723.95,157.47]
["2011-08-01",{"v":0,"d":"0.00%"},0,{"v":1566.61,"d":"1,566.61"},{"v":0.075,"d":"7.50%"},117.49,{"v":2347.85,"d":"2,347.85"},{"v":0.15,"d":"15.00%"},293.58,{"v":3130.51,"d":"3,130.51"},{"v":0.225,"d":"22.50%"},528.37,{"v":3911.63,"d":"3,911.63"},{"v":0.275,"d":"27.50%"},723.95,157.47]
["2011-09-01",{"v":0,"d":"0.00%"},0,{"v":1566.61,"d":"1,566.61"},{"v":0.075,"d":"7.50%"},117.49,{"v":2347.85,"d":"2,347.85"},{"v":0.15,"d":"15.00%"},293.58,{"v":3130.51,"d":"3,130.51"},{"v":0.225,"d":"22.50%"},528.37,{"v":3911.63,"d":"3,911.63"},{"v":0.275,"d":"27.50%"},723.95,157.47]
["2011-10-01",{"v":0,"d":"0.00%"},0,{"v":1566.61,"d":"1,566.61"},{"v":0.075,"d":"7.50%"},117.49,{"v":2347.85,"d":"2,347.85"},{"v":0.15,"d":"15.00%"},293.58,{"v":3130.51,"d":"3,130.51"},{"v":0.225,"d":"22.50%"},528.37,{"v":3911.63,"d":"3,911.63"},{"v":0.275,"d":"27.50%"},723.95,157.47]
["2011-11-01",{"v":0,"d":"0.00%"},0,{"v":1566.61,"d":"1,566.61"},{"v":0.075,"d":"7.50%"},117.49,{"v":2347.85,"d":"2,347.85"},{"v":0.15,"d":"15.00%"},293.58,{"v":3130.51,"d":"3,130.51"},{"v":0.225,"d":"22.50%"},528.37,{"v":3911.63,"d":"3,911.63"},{"v":0.275,"d":"27.50%"},723.95,157.47]
["2011-12-01",{"v":0,"d":"0.00%"},0,{"v":1566.61,"d":"1,566.61"},{"v":0.075,"d":"7.50%"},117.49,{"v":2347.85,"d":"2,347.85"},{"v":0.15,"d":"15.00%"},293.58,{"v":3130.51,"d":"3,130.51"},{"v":0.225,"d":"22.50%"},528.37,{"v":3911.63,"d":"3,911.63"},{"v":0.275,"d":"27.50%"},723.95,157.47]
["2012-01-01",{"v":0,"d":"0.00%"},0,{"v":1637.11,"d":"1,637.11"},{"v":0.075,"d":"7.50%"},122.78,{"v":2453.5,"d":"2,453.50"},{"v":0.15,"d":"15.00%"},{"v":306.8,"d":"306.80"},{"v":3271.38,"d":"3,271.38"},{"v":0.225,"d":"22.50%"},552.15,{"v":4087.65,"d":"4,087.65"},{"v":0.275,"d":"27.50%"},756.53,164.56]
["2012-02-01",{"v":0,"d":"0.00%"},0,{"v":1637.11,"d":"1,637.11"},{"v":0.075,"d":"7.50%"},122.78,{"v":2453.5,"d":"2,453.50"},{"v":0.15,"d":"15.00%"},{"v":306.8,"d":"306.80"},{"v":3271.38,"d":"3,271.38"},{"v":0.225,"d":"22.50%"},552.15,{"v":4087.65,"d":"4,087.65"},{"v":0.275,"d":"27.50%"},756.53,164.56]
["2012-03-01",{"v":0,"d":"0.00%"},0,{"v":1637.11,"d":"1,637.11"},{"v":0.075,"d":"7.50%"},122.78,{"v":2453.5,"d":"2,453.50"},{"v":0.15,"d":"15.00%"},{"v":306.8,"d":"306.80"},{"v":3271.38,"d":"3,271.38"},{"v":0.225,"d":"22.50%"},552.15,{"v":4087.65,"d":"4,087.65"},{"v":0.275,"d":"27.50%"},756.53,164.56]
["2012-04-01",{"v":0,"d":"0.00%"},0,{"v":1637.11,"d":"1,637.11"},{"v":0.075,"d":"7.50%"},122.78,{"v":2453.5,"d":"2,453.50"},{"v":0.15,"d":"15.00%"},{"v":306.8,"d":"306.80"},{"v":3271.38,"d":"3,271.38"},{"v":0.225,"d":"22.50%"},552.15,{"v":4087.65,"d":"4,087.65"},{"v":0.275,"d":"27.50%"},756.53,164.56]
["2012-05-01",{"v":0,"d":"0.00%"},0,{"v":1637.11,"d":"1,637.11"},{"v":0.075,"d":"7.50%"},122.78,{"v":2453.5,"d":"2,453.50"},{"v":0.15,"d":"15.00%"},{"v":306.8,"d":"306.80"},{"v":3271.38,"d":"3,271.38"},{"v":0.225,"d":"22.50%"},552.15,{"v":4087.65,"d":"4,087.65"},{"v":0.275,"d":"27.50%"},756.53,164.56]
["2012-06-01",{"v":0,"d":"0.00%"},0,{"v":1637.11,"d":"1,637.11"},{"v":0.075,"d":"7.50%"},122.78,{"v":2453.5,"d":"2,453.50"},{"v":0.15,"d":"15.00%"},{"v":306.8,"d":"306.80"},{"v":3271.38,"d":"3,271.38"},{"v":0.225,"d":"22.50%"},552.15,{"v":4087.65,"d":"4,087.65"},{"v":0.275,"d":"27.50%"},756.53,164.56]
["2012-07-01",{"v":0,"d":"0.00%"},0,{"v":1637.11,"d":"1,637.11"},{"v":0.075,"d":"7.50%"},122.78,{"v":2453.5,"d":"2,453.50"},{"v":0.15,"d":"15.00%"},{"v":306.8,"d":"306.80"},{"v":3271.38,"d":"3,271.38"},{"v":0.225,"d":"22.50%"},552.15,{"v":4087.65,"d":"4,087.65"},{"v":0.275,"d":"27.50%"},756.53,164.56]
["2012-08-01",{"v":0,"d":"0.00%"},0,{"v":1637.11,"d":"1,637.11"},{"v":0.075,"d":"7.50%"},122.78,{"v":2453.5,"d":"2,453.50"},{"v":0.15,"d":"15.00%"},{"v":306.8,"d":"306.80"},{"v":3271.38,"d":"3,271.38"},{"v":0.225,"d":"22.50%"},552.15,{"v":4087.65,"d":"4,087.65"},{"v":0.275,"d":"27.50%"},756.53,164.56]
["2012-09-01",{"v":0,"d":"0.00%"},0,{"v":1637.11,"d":"1,637.11"},{"v":0.075,"d":"7.50%"},122.78,{"v":2453.5,"d":"2,453.50"},{"v":0.15,"d":"15.00%"},{"v":306.8,"d":"306.80"},{"v":3271.38,"d":"3,271.38"},{"v":0.225,"d":"22.50%"},552.15,{"v":4087.65,"d":"4,087.65"},{"v":0.275,"d":"27.50%"},756.53,164.56]
["2012-10-01",{"v":0,"d":"0.00%"},0,{"v":1637.11,"d":"1,637.11"},{"v":0.075,"d":"7.50%"},122.78,{"v":2453.5,"d":"2,453.50"},{"v":0.15,"d":"15.00%"},{"v":306.8,"d":"306.80"},{"v":3271.38,"d":"3,271.38"},{"v":0.225,"d":"22.50%"},552.15,{"v":4087.65,"d":"4,087.65"},{"v":0.275,"d":"27.50%"},756.53,164.56]
["2012-11-01",{"v":0,"d":"0.00%"},0,{"v":1637.11,"d":"1,637.11"},{"v":0.075,"d":"7.50%"},122.78,{"v":2453.5,"d":"2,453.50"},{"v":0.15,"d":"15.00%"},{"v":306.8,"d":"306.80"},{"v":3271.38,"d":"3,271.38"},{"v":0.225,"d":"22.50%"},552.15,{"v":4087.65,"d":"4,087.65"},{"v":0.275,"d":"27.50%"},756.53,164.56]
["2012-12-01",{"v":0,"d":"0.00%"},0,{"v":1637.11,"d":"1,637.11"},{"v":0.075,"d":"7.50%"},122.78,{"v":2453.5,"d":"2,453.50"},{"v":0.15,"d":"15.00%"},{"v":306.8,"d":"306.80"},{"v":3271.38,"d":"3,271.38"},{"v":0.225,"d":"22.50%"},552.15,{"v":4087.65,"d":"4,087.65"},{"v":0.275,"d":"27.50%"},756.53,164.56]
["2013-01-01",{"v":0,"d":"0.00%"},0,{"v":1710.78,"d":"1,710.78"},{"v":0.075,"d":"7.50%"},128.31,{"v":2563.92,"d":"2,563.92"},{"v":0.15,"d":"15.00%"},{"v":320.6,"d":"320.60"},{"v":3418.59,"d":"3,418.59"},{"v":0.225,"d":"22.50%"},{"v":577,"d":"577.00"},{"v":4271.59,"d":"4,271.59"},{"v":0.275,"d":"27.50%"},790.58,171.97]
["2013-02-01",{"v":0,"d":"0.00%"},0,{"v":1710.78,"d":"1,710.78"},{"v":0.075,"d":"7.50%"},128.31,{"v":2563.92,"d":"2,563.92"},{"v":0.15,"d":"15.00%"},{"v":320.6,"d":"320.60"},{"v":3418.59,"d":"3,418.59"},{"v":0.225,"d":"22.50%"},{"v":577,"d":"577.00"},{"v":4271.59,"d":"4,271.59"},{"v":0.275,"d":"27.50%"},790.58,171.97]
["2013-03-01",{"v":0,"d":"0.00%"},0,{"v":1710.78,"d":"1,710.78"},{"v":0.075,"d":"7.50%"},128.31,{"v":2563.92,"d":"2,563.92"},{"v":0.15,"d":"15.00%"},{"v":320.6,"d":"320.60"},{"v":3418.59,"d":"3,418.59"},{"v":0.225,"d":"22.50%"},{"v":577,"d":"577.00"},{"v":4271.59,"d":"4,271.59"},{"v":0.275,"d":"27.50%"},790.58,171.97]
["2013-04-01",{"v":0,"d":"0.00%"},0,{"v":1710.78,"d":"1,710.78"},{"v":0.075,"d":"7.50%"},128.31,{"v":2563.92,"d":"2,563.92"},{"v":0.15,"d":"15.00%"},{"v":320.6,"d":"320.60"},{"v":3418.59,"d":"3,418.59"},{"v":0.225,"d":"22.50%"},{"v":577,"d":"577.00"},{"v":4271.59,"d":"4,271.59"},{"v":0.275,"d":"27.50%"},790.58,171.97]
["2013-05-01",{"v":0,"d":"0.00%"},0,{"v":1710.78,"d":"1,710.78"},{"v":0.075,"d":"7.50%"},128.31,{"v":2563.92,"d":"2,563.92"},{"v":0.15,"d":"15.00%"},{"v":320.6,"d":"320.60"},{"v":3418.59,"d":"3,418.59"},{"v":0.225,"d":"22.50%"},{"v":577,"d":"577.00"},{"v":4271.59,"d":"4,271.59"},{"v":0.275,"d":"27.50%"},790.58,171.97]
["2013-06-01",{"v":0,"d":"0.00%"},0,{"v":1710.78,"d":"1,710.78"},{"v":0.075,"d":"7.50%"},128.31,{"v":2563.92,"d":"2,563.92"},{"v":0.15,"d":"15.00%"},{"v":320.6,"d":"320.60"},{"v":3418.59,"d":"3,418.59"},{"v":0.225,"d":"22.50%"},{"v":577,"d":"577.00"},{"v":4271.59,"d":"4,271.59"},{"v":0.275,"d":"27.50%"},790.58,171.97]
["2013-07-01",{"v":0,"d":"0.00%"},0,{"v":1710.78,"d":"1,710.78"},{"v":0.075,"d":"7.50%"},128.31,{"v":2563.92,"d":"2,563.92"},{"v":0.15,"d":"15.00%"},{"v":320.6,"d":"320.60"},{"v":3418.59,"d":"3,418.59"},{"v":0.225,"d":"22.50%"},{"v":577,"d":"577.00"},{"v":4271.59,"d":"4,271.59"},{"v":0.275,"d":"27.50%"},790.58,171.97]
["2013-08-01",{"v":0,"d":"0.00%"},0,{"v":1710.78,"d":"1,710.78"},{"v":0.075,"d":"7.50%"},128.31,{"v":2563.92,"d":"2,563.92"},{"v":0.15,"d":"15.00%"},{"v":320.6,"d":"320.60"},{"v":3418.59,"d":"3,418.59"},{"v":0.225,"d":"22.50%"},{"v":577,"d":"577.00"},{"v":4271.59,"d":"4,271.59"},{"v":0.275,"d":"27.50%"},790.58,171.97]
["2013-09-01",{"v":0,"d":"0.00%"},0,{"v":1710.78,"d":"1,710.78"},{"v":0.075,"d":"7.50%"},128.31,{"v":2563.92,"d":"2,563.92"},{"v":0.15,"d":"15.00%"},{"v":320.6,"d":"320.60"},{"v":3418.59,"d":"3,418.59"},{"v":0.225,"d":"22.50%"},{"v":577,"d":"577.00"},{"v":4271.59,"d":"4,271.59"},{"v":0.275,"d":"27.50%"},790.58,171.97]
["2013-10-01",{"v":0,"d":"0.00%"},0,{"v":1710.78,"d":"1,710.78"},{"v":0.075,"d":"7.50%"},128.31,{"v":2563.92,"d":"2,563.92"},{"v":0.15,"d":"15.00%"},{"v":320.6,"d":"320.60"},{"v":3418.59,"d":"3,418.59"},{"v":0.225,"d":"22.50%"},{"v":577,"d":"577.00"},{"v":4271.59,"d":"4,271.59"},{"v":0.275,"d":"27.50%"},790.58,171.97]
["2013-11-01",{"v":0,"d":"0.00%"},0,{"v":1710.78,"d":"1,710.78"},{"v":0.075,"d":"7.50%"},128.31,{"v":2563.92,"d":"2,563.92"},{"v":0.15,"d":"15.00%"},{"v":320.6,"d":"320.60"},{"v":3418.59,"d":"3,418.59"},{"v":0.225,"d":"22.50%"},{"v":577,"d":"577.00"},{"v":4271.59,"d":"4,271.59"},{"v":0.275,"d":"27.50%"},790.58,171.97]
["2013-12-01",{"v":0,"d":"0.00%"},0,{"v":1710.78,"d":"1,710.78"},{"v":0.075,"d":"7.50%"},128.31,{"v":2563.92,"d":"2,563.92"},{"v":0.15,"d":"15.00%"},{"v":320.6,"d":"320.60"},{"v":3418.59,"d":"3,418.59"},{"v":0.225,"d":"22.50%"},{"v":577,"d":"577.00"},{"v":4271.59,"d":"4,271.59"},{"v":0.275,"d":"27.50%"},790.58,171.97]
["2014-01-01",{"v":0,"d":"0.00%"},0,{"v":1787.77,"d":"1,787.77"},{"v":0.075,"d":"7.50%"},134.08,{"v":2679.29,"d":"2,679.29"},{"v":0.15,"d":"15.00%"},335.03,{"v":3572.43,"d":"3,572.43"},{"v":0.225,"d":"22.50%"},602.96,{"v":4463.81,"d":"4,463.81"},{"v":0.275,"d":"27.50%"},826.15,{"v":179.1,"d":"179.10"}]
["2014-02-01",{"v":0,"d":"0.00%"},0,{"v":1787.77,"d":"1,787.77"},{"v":0.075,"d":"7.50%"},134.08,{"v":2679.29,"d":"2,679.29"},{"v":0.15,"d":"15.00%"},335.03,{"v":3572.43,"d":"3,572.43"},{"v":0.225,"d":"22.50%"},602.96,{"v":4463.81,"d":"4,463.81"},{"v":0.275,"d":"27.50%"},826.15,{"v":179.1,"d":"179.10"}]
["2014-03-01",{"v":0,"d":"0.00%"},0,{"v":1787.77,"d":"1,787.77"},{"v":0.075,"d":"7.50%"},134.08,{"v":2679.29,"d":"2,679.29"},{"v":0.15,"d":"15.00%"},335.03,{"v":3572.43,"d":"3,572.43"},{"v":0.225,"d":"22.50%"},602.96,{"v":4463.81,"d":"4,463.81"},{"v":0.275,"d":"27.50%"},826.15,{"v":179.1,"d":"179.10"}]
["2014-04-01",{"v":0,"d":"0.00%"},0,{"v":1787.77,"d":"1,787.77"},{"v":0.075,"d":"7.50%"},134.08,{"v":2679.29,"d":"2,679.29"},{"v":0.15,"d":"15.00%"},335.03,{"v":3572.43,"d":"3,572.43"},{"v":0.225,"d":"22.50%"},602.96,{"v":4463.81,"d":"4,463.81"},{"v":0.275,"d":"27.50%"},826.15,{"v":179.1,"d":"179.10"}]
["2014-05-01",{"v":0,"d":"0.00%"},0,{"v":1787.77,"d":"1,787.77"},{"v":0.075,"d":"7.50%"},134.08,{"v":2679.29,"d":"2,679.29"},{"v":0.15,"d":"15.00%"},335.03,{"v":3572.43,"d":"3,572.43"},{"v":0.225,"d":"22.50%"},602.96,{"v":4463.81,"d":"4,463.81"},{"v":0.275,"d":"27.50%"},826.15,{"v":179.1,"d":"179.10"}]
["2014-06-01",{"v":0,"d":"0.00%"},0,{"v":1787.77,"d":"1,787.77"},{"v":0.075,"d":"7.50%"},134.08,{"v":2679.29,"d":"2,679.29"},{"v":0.15,"d":"15.00%"},335.03,{"v":3572.43,"d":"3,572.43"},{"v":0.225,"d":"22.50%"},602.96,{"v":4463.81,"d":"4,463.81"},{"v":0.275,"d":"27.50%"},826.15,{"v":179.1,"d":"179.10"}]
["2014-07-01",{"v":0,"d":"0.00%"},0,{"v":1787.77,"d":"1,787.77"},{"v":0.075,"d":"7.50%"},134.08,{"v":2679.29,"d":"2,679.29"},{"v":0.15,"d":"15.00%"},335.03,{"v":3572.43,"d":"3,572.43"},{"v":0.225,"d":"22.50%"},602.96,{"v":4463.81,"d":"4,463.81"},{"v":0.275,"d":"27.50%"},826.15,{"v":179.1,"d":"179.10"}]
["2014-08-01",{"v":0,"d":"0.00%"},0,{"v":1787.77,"d":"1,787.77"},{"v":0.075,"d":"7.50%"},134.08,{"v":2679.29,"d":"2,679.29"},{"v":0.15,"d":"15.00%"},335.03,{"v":3572.43,"d":"3,572.43"},{"v":0.225,"d":"22.50%"},602.96,{"v":4463.81,"d":"4,463.81"},{"v":0.275,"d":"27.50%"},826.15,{"v":179.1,"d":"179.10"}]
["2014-09-01",{"v":0,"d":"0.00%"},0,{"v":1787.77,"d":"1,787.77"},{"v":0.075,"d":"7.50%"},134.08,{"v":2679.29,"d":"2,679.29"},{"v":0.15,"d":"15.00%"},335.03,{"v":3572.43,"d":"3,572.43"},{"v":0.225,"d":"22.50%"},602.96,{"v":4463.81,"d":"4,463.81"},{"v":0.275,"d":"27.50%"},826.15,{"v":179.1,"d":"179.10"}]
["2014-10-01",{"v":0,"d":"0.00%"},0,{"v":1787.77,"d":"1,787.77"},{"v":0.075,"d":"7.50%"},134.08,{"v":2679.29,"d":"2,679.29"},{"v":0.15,"d":"15.00%"},335.03,{"v":3572.43,"d":"3,572.43"},{"v":0.225,"d":"22.50%"},602.96,{"v":4463.81,"d":"4,463.81"},{"v":0.275,"d":"27.50%"},826.15,{"v":179.1,"d":"179.10"}]
["2014-11-01",{"v":0,"d":"0.00%"},0,{"v":1787.77,"d":"1,787.77"},{"v":0.075,"d":"7.50%"},134.08,{"v":2679.29,"d":"2,679.29"},{"v":0.15,"d":"15.00%"},335.03,{"v":3572.43,"d":"3,572.43"},{"v":0.225,"d":"22.50%"},602.96,{"v":4463.81,"d":"4,463.81"},{"v":0.275,"d":"27.50%"},826.15,{"v":179.1,"d":"179.10"}]
["2014-12-01",{"v":0,"d":"0.00%"},0,{"v":1787.77,"d":"1,787.77"},{"v":0.075,"d":"7.50%"},134.08,{"v":2679.29,"d":"2,679.29"},{"v":0.15,"d":"15.00%"},335.03,{"v":3572.43,"d":"3,572.43"},{"v":0.225,"d":"22.50%"},602.96,{"v":4463.81,"d":"4,463.81"},{"v":0.275,"d":"27.50%"},826.15,{"v":179.1,"d":"179.10"}]
["2015-01-01",{"v":0,"d":"0.00%"},0,{"v":1787.77,"d":"1,787.77"},{"v":0.075,"d":"7.50%"},134.08,{"v":2679.29,"d":"2,679.29"},{"v":0.15,"d":"15.00%"},335.03,{"v":3572.43,"d":"3,572.43"},{"v":0.225,"d":"22.50%"},602.96,{"v":4463.81,"d":"4,463.81"},{"v":0.275,"d":"27.50%"},826.15,{"v":179.1,"d":"179.10"}]
["2015-02-01",{"v":0,"d":"0.00%"},0,{"v":1787.77,"d":"1,787.77"},{"v":0.075,"d":"7.50%"},134.08,{"v":2679.29,"d":"2,679.29"},{"v":0.15,"d":"15.00%"},335.03,{"v":3572.43,"d":"3,572.43"},{"v":0.225,"d":"22.50%"},602.96,{"v":4463.81,"d":"4,463.81"},{"v":0.275,"d":"27.50%"},826.15,{"v":179.1,"d":"179.10"}]
["2015-03-01",{"v":0,"d":"0.00%"},0,{"v":1787.77,"d":"1,787.77"},{"v":0.075,"d":"7.50%"},134.08,{"v":2679.29,"d":"2,679.29"},{"v":0.15,"d":"15.00%"},335.03,{"v":3572.43,"d":"3,572.43"},{"v":0.225,"d":"22.50%"},602.96,{"v":4463.81,"d":"4,463.81"},{"v":0.275,"d":"27.50%"},826.15,{"v":179.1,"d":"179.10"}]
["2015-04-01",{"v":0,"d":"0.00%"},0,{"v":1903.98,"d":"1,903.98"},{"v":0.075,"d":"7.50%"},{"v":142.8,"d":"142.80"},{"v":2826.65,"d":"2,826.65"},{"v":0.15,"d":"15.00%"},{"v":354.8,"d":"354.80"},{"v":3751.05,"d":"3,751.05"},{"v":0.225,"d":"22.50%"},636.13,{"v":4664.68,"d":"4,664.68"},{"v":0.275,"d":"27.50%"},869.36,189.59]
["2015-05-01",{"v":0,"d":"0.00%"},0,{"v":1903.98,"d":"1,903.98"},{"v":0.075,"d":"7.50%"},{"v":142.8,"d":"142.80"},{"v":2826.65,"d":"2,826.65"},{"v":0.15,"d":"15.00%"},{"v":354.8,"d":"354.80"},{"v":3751.05,"d":"3,751.05"},{"v":0.225,"d":"22.50%"},636.13,{"v":4664.68,"d":"4,664.68"},{"v":0.275,"d":"27.50%"},869.36,189.59]
["2015-06-01",{"v":0,"d":"0.00%"},0,{"v":1903.98,"d":"1,903.98"},{"v":0.075,"d":"7.50%"},{"v":142.8,"d":"142.80"},{"v":2826.65,"d":"2,826.65"},{"v":0.15,"d":"15.00%"},{"v":354.8,"d":"354.80"},{"v":3751.05,"d":"3,751.05"},{"v":0.225,"d":"22.50%"},636.13,{"v":4664.68,"d":"4,664.68"},{"v":0.275,"d":"27.50%"},869.36,189.59]
["2015-07-01",{"v":0,"d":"0.00%"},0,{"v":1903.98,"d":"1,903.98"},{"v":0.075,"d":"7.50%"},{"v":142.8,"d":"142.80"},{"v":2826.65,"d":"2,826.65"},{"v":0.15,"d":"15.00%"},{"v":354.8,"d":"354.80"},{"v":3751.05,"d":"3,751.05"},{"v":0.225,"d":"22.50%"},636.13,{"v":4664.68,"d":"4,664.68"},{"v":0.275,"d":"27.50%"},869.36,189.59]
["2015-08-01",{"v":0,"d":"0.00%"},0,{"v":1903.98,"d":"1,903.98"},{"v":0.075,"d":"7.50%"},{"v":142.8,"d":"142.80"},{"v":2826.65,"d":"2,826.65"},{"v":0.15,"d":"15.00%"},{"v":354.8,"d":"354.80"},{"v":3751.05,"d":"3,751.05"},{"v":0.225,"d":"22.50%"},636.13,{"v":4664.68,"d":"4,664.68"},{"v":0.275,"d":"27.50%"},869.36,189.59]
["2015-09-01",{"v":0,"d":"0.00%"},0,{"v":1903.98,"d":"1,903.98"},{"v":0.075,"d":"7.50%"},{"v":142.8,"d":"142.80"},{"v":2826.65,"d":"2,826.65"},{"v":0.15,"d":"15.00%"},{"v":354.8,"d":"354.80"},{"v":3751.05,"d":"3,751.05"},{"v":0.225,"d":"22.50%"},636.13,{"v":4664.68,"d":"4,664.68"},{"v":0.275,"d":"27.50%"},869.36,189.59]
["2015-10-01",{"v":0,"d":"0.00%"},0,{"v":1903.98,"d":"1,903.98"},{"v":0.075,"d":"7.50%"},{"v":142.8,"d":"142.80"},{"v":2826.65,"d":"2,826.65"},{"v":0.15,"d":"15.00%"},{"v":354.8,"d":"354.80"},{"v":3751.05,"d":"3,751.05"},{"v":0.225,"d":"22.50%"},636.13,{"v":4664.68,"d":"4,664.68"},{"v":0.275,"d":"27.50%"},869.36,189.59]
["2015-11-01",{"v":0,"d":"0.00%"},0,{"v":1903.98,"d":"1,903.98"},{"v":0.075,"d":"7.50%"},{"v":142.8,"d":"142.80"},{"v":2826.65,"d":"2,826.65"},{"v":0.15,"d":"15.00%"},{"v":354.8,"d":"354.80"},{"v":3751.05,"d":"3,751.05"},{"v":0.225,"d":"22.50%"},636.13,{"v":4664.68,"d":"4,664.68"},{"v":0.275,"d":"27.50%"},869.36,189.59]
["2015-12-01",{"v":0,"d":"0.00%"},0,{"v":1903.98,"d":"1,903.98"},{"v":0.075,"d":"7.50%"},{"v":142.8,"d":"142.80"},{"v":2826.65,"d":"2,826.65"},{"v":0.15,"d":"15.00%"},{"v":354.8,"d":"354.80"},{"v":3751.05,"d":"3,751.05"},{"v":0.225,"d":"22.50%"},636.13,{"v":4664.68,"d":"4,664.68"},{"v":0.275,"d":"27.50%"},869.36,189.59]
["2016-01-01",{"v":0,"d":"0.00%"},0,{"v":1903.98,"d":"1,903.98"},{"v":0.075,"d":"7.50%"},{"v":142.8,"d":"142.80"},{"v":2826.65,"d":"2,826.65"},{"v":0.15,"d":"15.00%"},{"v":354.8,"d":"354.80"},{"v":3751.05,"d":"3,751.05"},{"v":0.225,"d":"22.50%"},636.13,{"v":4664.68,"d":"4,664.68"},{"v":0.275,"d":"27.50%"},869.36,189.59]
["2016-02-01",{"v":0,"d":"0.00%"},0,{"v":1903.98,"d":"1,903.98"},{"v":0.075,"d":"7.50%"},{"v":142.8,"d":"142.80"},{"v":2826.65,"d":"2,826.65"},{"v":0.15,"d":"15.00%"},{"v":354.8,"d":"354.80"},{"v":3751.05,"d":"3,751.05"},{"v":0.225,"d":"22.50%"},636.13,{"v":4664.68,"d":"4,664.68"},{"v":0.275,"d":"27.50%"},869.36,189.59]
["2016-03-01",{"v":0,"d":"0.00%"},0,{"v":1903.98,"d":"1,903.98"},{"v":0.075,"d":"7.50%"},{"v":142.8,"d":"142.80"},{"v":2826.65,"d":"2,826.65"},{"v":0.15,"d":"15.00%"},{"v":354.8,"d":"354.80"},{"v":3751.05,"d":"3,751.05"},{"v":0.225,"d":"22.50%"},636.13,{"v":4664.68,"d":"4,664.68"},{"v":0.275,"d":"27.50%"},869.36,189.59]
["2016-04-01",{"v":0,"d":"0.00%"},0,{"v":1903.98,"d":"1,903.98"},{"v":0.075,"d":"7.50%"},{"v":142.8,"d":"142.80"},{"v":2826.65,"d":"2,826.65"},{"v":0.15,"d":"15.00%"},{"v":354.8,"d":"354.80"},{"v":3751.05,"d":"3,751.05"},{"v":0.225,"d":"22.50%"},636.13,{"v":4664.68,"d":"4,664.68"},{"v":0.275,"d":"27.50%"},869.36,189.59]
["2016-05-01",{"v":0,"d":"0.00%"},0,{"v":1903.98,"d":"1,903.98"},{"v":0.075,"d":"7.50%"},{"v":142.8,"d":"142.80"},{"v":2826.65,"d":"2,826.65"},{"v":0.15,"d":"15.00%"},{"v":354.8,"d":"354.80"},{"v":3751.05,"d":"3,751.05"},{"v":0.225,"d":"22.50%"},636.13,{"v":4664.68,"d":"4,664.68"},{"v":0.275,"d":"27.50%"},869.36,189.59]
["2016-06-01",{"v":0,"d":"0.00%"},0,{"v":1903.98,"d":"1,903.98"},{"v":0.075,"d":"7.50%"},{"v":142.8,"d":"142.80"},{"v":2826.65,"d":"2,826.65"},{"v":0.15,"d":"15.00%"},{"v":354.8,"d":"354.80"},{"v":3751.05,"d":"3,751.05"},{"v":0.225,"d":"22.50%"},636.13,{"v":4664.68,"d":"4,664.68"},{"v":0.275,"d":"27.50%"},869.36,189.59]
["2016-07-01",{"v":0,"d":"0.00%"},0,{"v":1903.98,"d":"1,903.98"},{"v":0.075,"d":"7.50%"},{"v":142.8,"d":"142.80"},{"v":2826.65,"d":"2,826.65"},{"v":0.15,"d":"15.00%"},{"v":354.8,"d":"354.80"},{"v":3751.05,"d":"3,751.05"},{"v":0.225,"d":"22.50%"},636.13,{"v":4664.68,"d":"4,664.68"},{"v":0.275,"d":"27.50%"},869.36,189.59]
["2016-08-01",{"v":0,"d":"0.00%"},0,{"v":1903.98,"d":"1,903.98"},{"v":0.075,"d":"7.50%"},{"v":142.8,"d":"142.80"},{"v":2826.65,"d":"2,826.65"},{"v":0.15,"d":"15.00%"},{"v":354.8,"d":"354.80"},{"v":3751.05,"d":"3,751.05"},{"v":0.225,"d":"22.50%"},636.13,{"v":4664.68,"d":"4,664.68"},{"v":0.275,"d":"27.50%"},869.36,189.59]
["2016-09-01",{"v":0,"d":"0.00%"},0,{"v":1903.98,"d":"1,903.98"},{"v":0.075,"d":"7.50%"},{"v":142.8,"d":"142.80"},{"v":2826.65,"d":"2,826.65"},{"v":0.15,"d":"15.00%"},{"v":354.8,"d":"354.80"},{"v":3751.05,"d":"3,751.05"},{"v":0.225,"d":"22.50%"},636.13,{"v":4664.68,"d":"4,664.68"},{"v":0.275,"d":"27.50%"},869.36,189.59]
["2016-10-01",{"v":0,"d":"0.00%"},0,{"v":1903.98,"d":"1,903.98"},{"v":0.075,"d":"7.50%"},{"v":142.8,"d":"142.80"},{"v":2826.65,"d":"2,826.65"},{"v":0.15,"d":"15.00%"},{"v":354.8,"d":"354.80"},{"v":3751.05,"d":"3,751.05"},{"v":0.225,"d":"22.50%"},636.13,{"v":4664.68,"d":"4,664.68"},{"v":0.275,"d":"27.50%"},869.36,189.59]
["2016-11-01",{"v":0,"d":"0.00%"},0,{"v":1903.98,"d":"1,903.98"},{"v":0.075,"d":"7.50%"},{"v":142.8,"d":"142.80"},{"v":2826.65,"d":"2,826.65"},{"v":0.15,"d":"15.00%"},{"v":354.8,"d":"354.80"},{"v":3751.05,"d":"3,751.05"},{"v":0.225,"d":"22.50%"},636.13,{"v":4664.68,"d":"4,664.68"},{"v":0.275,"d":"27.50%"},869.36,189.59]
["2016-12-01",{"v":0,"d":"0.00%"},0,{"v":1903.98,"d":"1,903.98"},{"v":0.075,"d":"7.50%"},{"v":142.8,"d":"142.80"},{"v":2826.65,"d":"2,826.65"},{"v":0.15,"d":"15.00%"},{"v":354.8,"d":"354.80"},{"v":3751.05,"d":"3,751.05"},{"v":0.225,"d":"22.50%"},636.13,{"v":4664.68,"d":"4,664.68"},{"v":0.275,"d":"27.50%"},869.36,189.59]
["2017-01-01",{"v":0,"d":"0.00%"},0,{"v":1903.98,"d":"1,903.98"},{"v":0.075,"d":"7.50%"},{"v":142.8,"d":"142.80"},{"v":2826.65,"d":"2,826.65"},{"v":0.15,"d":"15.00%"},{"v":354.8,"d":"354.80"},{"v":3751.05,"d":"3,751.05"},{"v":0.225,"d":"22.50%"},636.13,{"v":4664.68,"d":"4,664.68"},{"v":0.275,"d":"27.50%"},869.36,189.59]
["2017-02-01",{"v":0,"d":"0.00%"},0,{"v":1903.98,"d":"1,903.98"},{"v":0.075,"d":"7.50%"},{"v":142.8,"d":"142.80"},{"v":2826.65,"d":"2,826.65"},{"v":0.15,"d":"15.00%"},{"v":354.8,"d":"354.80"},{"v":3751.05,"d":"3,751.05"},{"v":0.225,"d":"22.50%"},636.13,{"v":4664.68,"d":"4,664.68"},{"v":0.275,"d":"27.50%"},869.36,189.59]
["2017-03-01",{"v":0,"d":"0.00%"},0,{"v":1903.98,"d":"1,903.98"},{"v":0.075,"d":"7.50%"},{"v":142.8,"d":"142.80"},{"v":2826.65,"d":"2,826.65"},{"v":0.15,"d":"15.00%"},{"v":354.8,"d":"354.80"},{"v":3751.05,"d":"3,751.05"},{"v":0.225,"d":"22.50%"},636.13,{"v":4664.68,"d":"4,664.68"},{"v":0.275,"d":"27.50%"},869.36,189.59]
["2017-04-01",{"v":0,"d":"0.00%"},0,{"v":1903.98,"d":"1,903.98"},{"v":0.075,"d":"7.50%"},{"v":142.8,"d":"142.80"},{"v":2826.65,"d":"2,826.65"},{"v":0.15,"d":"15.00%"},{"v":354.8,"d":"354.80"},{"v":3751.05,"d":"3,751.05"},{"v":0.225,"d":"22.50%"},636.13,{"v":4664.68,"d":"4,664.68"},{"v":0.275,"d":"27.50%"},869.36,189.59]
["2017-05-01",{"v":0,"d":"0.00%"},0,{"v":1903.98,"d":"1,903.98"},{"v":0.075,"d":"7.50%"},{"v":142.8,"d":"142.80"},{"v":2826.65,"d":"2,826.65"},{"v":0.15,"d":"15.00%"},{"v":354.8,"d":"354.80"},{"v":3751.05,"d":"3,751.05"},{"v":0.225,"d":"22.50%"},636.13,{"v":4664.68,"d":"4,664.68"},{"v":0.275,"d":"27.50%"},869.36,189.59]
["2017-06-01",{"v":0,"d":"0.00%"},0,{"v":1903.98,"d":"1,903.98"},{"v":0.075,"d":"7.50%"},{"v":142.8,"d":"142.80"},{"v":2826.65,"d":"2,826.65"},{"v":0.15,"d":"15.00%"},{"v":354.8,"d":"354.80"},{"v":3751.05,"d":"3,751.05"},{"v":0.225,"d":"22.50%"},636.13,{"v":4664.68,"d":"4,664.68"},{"v":0.275,"d":"27.50%"},869.36,189.59]
["2017-07-01",{"v":0,"d":"0.00%"},0,{"v":1903.98,"d":"1,903.98"},{"v":0.075,"d":"7.50%"},{"v":142.8,"d":"142.80"},{"v":2826.65,"d":"2,826.65"},{"v":0.15,"d":"15.00%"},{"v":354.8,"d":"354.80"},{"v":3751.05,"d":"3,751.05"},{"v":0.225,"d":"22.50%"},636.13,{"v":4664.68,"d":"4,664.68"},{"v":0.275,"d":"27.50%"},869.36,189.59]
["2017-08-01",{"v":0,"d":"0.00%"},0,{"v":1903.98,"d":"1,903.98"},{"v":0.075,"d":"7.50%"},{"v":142.8,"d":"142.80"},{"v":2826.65,"d":"2,826.65"},{"v":0.15,"d":"15.00%"},{"v":354.8,"d":"354.80"},{"v":3751.05,"d":"3,751.05"},{"v":0.225,"d":"22.50%"},636.13,{"v":4664.68,"d":"4,664.68"},{"v":0.275,"d":"27.50%"},869.36,189.59]
["2017-09-01",{"v":0,"d":"0.00%"},0,{"v":1903.98,"d":"1,903.98"},{"v":0.075,"d":"7.50%"},{"v":142.8,"d":"142.80"},{"v":2826.65,"d":"2,826.65"},{"v":0.15,"d":"15.00%"},{"v":354.8,"d":"354.80"},{"v":3751.05,"d":"3,751.05"},{"v":0.225,"d":"22.50%"},636.13,{"v":4664.68,"d":"4,664.68"},{"v":0.275,"d":"27.50%"},869.36,189.59]
["2017-10-01",{"v":0,"d":"0.00%"},0,{"v":1903.98,"d":"1,903.98"},{"v":0.075,"d":"7.50%"},{"v":142.8,"d":"142.80"},{"v":2826.65,"d":"2,826.65"},{"v":0.15,"d":"15.00%"},{"v":354.8,"d":"354.80"},{"v":3751.05,"d":"3,751.05"},{"v":0.225,"d":"22.50%"},636.13,{"v":4664.68,"d":"4,664.68"},{"v":0.275,"d":"27.50%"},869.36,189.59]
["2017-11-01",{"v":0,"d":"0.00%"},0,{"v":1903.98,"d":"1,903.98"},{"v":0.075,"d":"7.50%"},{"v":142.8,"d":"142.80"},{"v":2826.65,"d":"2,826.65"},{"v":0.15,"d":"15.00%"},{"v":354.8,"d":"354.80"},{"v":3751.05,"d":"3,751.05"},{"v":0.225,"d":"22.50%"},636.13,{"v":4664.68,"d":"4,664.68"},{"v":0.275,"d":"27.50%"},869.36,189.59]
["2017-12-01",{"v":0,"d":"0.00%"},0,{"v":1903.98,"d":"1,903.98"},{"v":0.075,"d":"7.50%"},{"v":142.8,"d":"142.80"},{"v":2826.65,"d":"2,826.65"},{"v":0.15,"d":"15.00%"},{"v":354.8,"d":"354.80"},{"v":3751.05,"d":"3,751.05"},{"v":0.225,"d":"22.50%"},636.13,{"v":4664.68,"d":"4,664.68"},{"v":0.275,"d":"27.50%"},869.36,189.59]
["2018-01-01",{"v":0,"d":"0.00%"},0,{"v":1903.98,"d":"1,903.98"},{"v":0.075,"d":"7.50%"},{"v":142.8,"d":"142.80"},{"v":2826.65,"d":"2,826.65"},{"v":0.15,"d":"15.00%"},{"v":354.8,"d":"354.80"},{"v":3751.05,"d":"3,751.05"},{"v":0.225,"d":"22.50%"},636.13,{"v":4664.68,"d":"4,664.68"},{"v":0.275,"d":"27.50%"},869.36,189.59]
["2018-02-01",{"v":0,"d":"0.00%"},0,{"v":1903.98,"d":"1,903.98"},{"v":0.075,"d":"7.50%"},{"v":142.8,"d":"142.80"},{"v":2826.65,"d":"2,826.65"},{"v":0.15,"d":"15.00%"},{"v":354.8,"d":"354.80"},{"v":3751.05,"d":"3,751.05"},{"v":0.225,"d":"22.50%"},636.13,{"v":4664.68,"d":"4,664.68"},{"v":0.275,"d":"27.50%"},869.36,189.59]
["2018-03-01",{"v":0,"d":"0.00%"},0,{"v":1903.98,"d":"1,903.98"},{"v":0.075,"d":"7.50%"},{"v":142.8,"d":"142.80"},{"v":2826.65,"d":"2,826.65"},{"v":0.15,"d":"15.00%"},{"v":354.8,"d":"354.80"},{"v":3751.05,"d":"3,751.05"},{"v":0.225,"d":"22.50%"},636.13,{"v":4664.68,"d":"4,664.68"},{"v":0.275,"d":"27.50%"},869.36,189.59]
["2018-04-01",{"v":0,"d":"0.00%"},0,{"v":1903.98,"d":"1,903.98"},{"v":0.075,"d":"7.50%"},{"v":142.8,"d":"142.80"},{"v":2826.65,"d":"2,826.65"},{"v":0.15,"d":"15.00%"},{"v":354.8,"d":"354.80"},{"v":3751.05,"d":"3,751.05"},{"v":0.225,"d":"22.50%"},636.13,{"v":4664.68,"d":"4,664.68"},{"v":0.275,"d":"27.50%"},869.36,189.59]
["2018-05-01",{"v":0,"d":"0.00%"},0,{"v":1903.98,"d":"1,903.98"},{"v":0.075,"d":"7.50%"},{"v":142.8,"d":"142.80"},{"v":2826.65,"d":"2,826.65"},{"v":0.15,"d":"15.00%"},{"v":354.8,"d":"354.80"},{"v":3751.05,"d":"3,751.05"},{"v":0.225,"d":"22.50%"},636.13,{"v":4664.68,"d":"4,664.68"},{"v":0.275,"d":"27.50%"},869.36,189.59]
["2018-06-01",{"v":0,"d":"0.00%"},0,{"v":1903.98,"d":"1,903.98"},{"v":0.075,"d":"7.50%"},{"v":142.8,"d":"142.80"},{"v":2826.65,"d":"2,826.65"},{"v":0.15,"d":"15.00%"},{"v":354.8,"d":"354.80"},{"v":3751.05,"d":"3,751.05"},{"v":0.225,"d":"22.50%"},636.13,{"v":4664.68,"d":"4,664.68"},{"v":0.275,"d":"27.50%"},869.36,189.59]
["2018-07-01",{"v":0,"d":"0.00%"},0,{"v":1903.98,"d":"1,903.98"},{"v":0.075,"d":"7.50%"},{"v":142.8,"d":"142.80"},{"v":2826.65,"d":"2,826.65"},{"v":0.15,"d":"15.00%"},{"v":354.8,"d":"354.80"},{"v":3751.05,"d":"3,751.05"},{"v":0.225,"d":"22.50%"},636.13,{"v":4664.68,"d":"4,664.68"},{"v":0.275,"d":"27.50%"},869.36,189.59]
["2018-08-01",{"v":0,"d":"0.00%"},0,{"v":1903.98,"d":"1,903.98"},{"v":0.075,"d":"7.50%"},{"v":142.8,"d":"142.80"},{"v":2826.65,"d":"2,826.65"},{"v":0.15,"d":"15.00%"},{"v":354.8,"d":"354.80"},{"v":3751.05,"d":"3,751.05"},{"v":0.225,"d":"22.50%"},636.13,{"v":4664.68,"d":"4,664.68"},{"v":0.275,"d":"27.50%"},869.36,189.59]
["2018-09-01",{"v":0,"d":"0.00%"},0,{"v":1903.98,"d":"1,903.98"},{"v":0.075,"d":"7.50%"},{"v":142.8,"d":"142.80"},{"v":2826.65,"d":"2,826.65"},{"v":0.15,"d":"15.00%"},{"v":354.8,"d":"354.80"},{"v":3751.05,"d":"3,751.05"},{"v":0.225,"d":"22.50%"},636.13,{"v":4664.68,"d":"4,664.68"},{"v":0.275,"d":"27.50%"},869.36,189.59]
["2018-10-01",{"v":0,"d":"0.00%"},0,{"v":1903.98,"d":"1,903.98"},{"v":0.075,"d":"7.50%"},{"v":142.8,"d":"142.80"},{"v":2826.65,"d":"2,826.65"},{"v":0.15,"d":"15.00%"},{"v":354.8,"d":"354.80"},{"v":3751.05,"d":"3,751.05"},{"v":0.225,"d":"22.50%"},636.13,{"v":4664.68,"d":"4,664.68"},{"v":0.275,"d":"27.50%"},869.36,189.59]
["2018-11-01",{"v":0,"d":"0.00%"},0,{"v":1903.98,"d":"1,903.98"},{"v":0.075,"d":"7.50%"},{"v":142.8,"d":"142.80"},{"v":2826.65,"d":"2,826.65"},{"v":0.15,"d":"15.00%"},{"v":354.8,"d":"354.80"},{"v":3751.05,"d":"3,751.05"},{"v":0.225,"d":"22.50%"},636.13,{"v":4664.68,"d":"4,664.68"},{"v":0.275,"d":"27.50%"},869.36,189.59]
["2018-12-01",{"v":0,"d":"0.00%"},0,{"v":1903.98,"d":"1,903.98"},{"v":0.075,"d":"7.50%"},{"v":142.8,"d":"142.80"},{"v":2826.65,"d":"2,826.65"},{"v":0.15,"d":"15.00%"},{"v":354.8,"d":"354.80"},{"v":3751.05,"d":"3,751.05"},{"v":0.225,"d":"22.50%"},636.13,{"v":4664.68,"d":"4,664.68"},{"v":0.275,"d":"27.50%"},869.36,189.59]
["2019-01-01",{"v":0,"d":"0.00%"},0,{"v":1903.98,"d":"1,903.98"},{"v":0.075,"d":"7.50%"},{"v":142.8,"d":"142.80"},{"v":2826.65,"d":"2,826.65"},{"v":0.15,"d":"15.00%"},{"v":354.8,"d":"354.80"},{"v":3751.05,"d":"3,751.05"},{"v":0.225,"d":"22.50%"},636.13,{"v":4664.68,"d":"4,664.68"},{"v":0.275,"d":"27.50%"},869.36,189.59]
["2019-02-01",{"v":0,"d":"0.00%"},0,{"v":1903.98,"d":"1,903.98"},{"v":0.075,"d":"7.50%"},{"v":142.8,"d":"142.80"},{"v":2826.65,"d":"2,826.65"},{"v":0.15,"d":"15.00%"},{"v":354.8,"d":"354.80"},{"v":3751.05,"d":"3,751.05"},{"v":0.225,"d":"22.50%"},636.13,{"v":4664.68,"d":"4,664.68"},{"v":0.275,"d":"27.50%"},869.36,189.59]
["2019-03-01",{"v":0,"d":"0.00%"},0,{"v":1903.98,"d":"1,903.98"},{"v":0.075,"d":"7.50%"},{"v":142.8,"d":"142.80"},{"v":2826.65,"d":"2,826.65"},{"v":0.15,"d":"15.00%"},{"v":354.8,"d":"354.80"},{"v":3751.05,"d":"3,751.05"},{"v":0.225,"d":"22.50%"},636.13,{"v":4664.68,"d":"4,664.68"},{"v":0.275,"d":"27.50%"},869.36,189.59]
["2019-04-01",{"v":0,"d":"0.00%"},0,{"v":1903.98,"d":"1,903.98"},{"v":0.075,"d":"7.50%"},{"v":142.8,"d":"142.80"},{"v":2826.65,"d":"2,826.65"},{"v":0.15,"d":"15.00%"},{"v":354.8,"d":"354.80"},{"v":3751.05,"d":"3,751.05"},{"v":0.225,"d":"22.50%"},636.13,{"v":4664.68,"d":"4,664.68"},{"v":0.275,"d":"27.50%"},869.36,189.59]
["2019-05-01",{"v":0,"d":"0.00%"},0,{"v":1903.98,"d":"1,903.98"},{"v":0.075,"d":"7.50%"},{"v":142.8,"d":"142.80"},{"v":2826.65,"d":"2,826.65"},{"v":0.15,"d":"15.00%"},{"v":354.8,"d":"354.80"},{"v":3751.05,"d":"3,751.05"},{"v":0.225,"d":"22.50%"},636.13,{"v":4664.68,"d":"4,664.68"},{"v":0.275,"d":"27.50%"},869.36,189.59]
["2019-06-01",{"v":0,"d":"0.00%"},0,{"v":1903.98,"d":"1,903.98"},{"v":0.075,"d":"7.50%"},{"v":142.8,"d":"142.80"},{"v":2826.65,"d":"2,826.65"},{"v":0.15,"d":"15.00%"},{"v":354.8,"d":"354.80"},{"v":3751.05,"d":"3,751.05"},{"v":0.225,"d":"22.50%"},636.13,{"v":4664.68,"d":"4,664.68"},{"v":0.275,"d":"27.50%"},869.36,189.59]
["2019-07-01",{"v":0,"d":"0.00%"},0,{"v":1903.98,"d":"1,903.98"},{"v":0.075,"d":"7.50%"},{"v":142.8,"d":"142.80"},{"v":2826.65,"d":"2,826.65"},{"v":0.15,"d":"15.00%"},{"v":354.8,"d":"354.80"},{"v":3751.05,"d":"3,751.05"},{"v":0.225,"d":"22.50%"},636.13,{"v":4664.68,"d":"4,664.68"},{"v":0.275,"d":"27.50%"},869.36,189.59]
["2019-08-01",{"v":0,"d":"0.00%"},0,{"v":1903.98,"d":"1,903.98"},{"v":0.075,"d":"7.50%"},{"v":142.8,"d":"142.80"},{"v":2826.65,"d":"2,826.65"},{"v":0.15,"d":"15.00%"},{"v":354.8,"d":"354.80"},{"v":3751.05,"d":"3,751.05"},{"v":0.225,"d":"22.50%"},636.13,{"v":4664.68,"d":"4,664.68"},{"v":0.275,"d":"27.50%"},869.36,189.59]
["2019-09-01",{"v":0,"d":"0.00%"},0,{"v":1903.98,"d":"1,903.98"},{"v":0.075,"d":"7.50%"},{"v":142.8,"d":"142.80"},{"v":2826.65,"d":"2,826.65"},{"v":0.15,"d":"15.00%"},{"v":354.8,"d":"354.80"},{"v":3751.05,"d":"3,751.05"},{"v":0.225,"d":"22.50%"},636.13,{"v":4664.68,"d":"4,664.68"},{"v":0.275,"d":"27.50%"},869.36,189.59]
["2019-10-01",{"v":0,"d":"0.00%"},0,{"v":1903.98,"d":"1,903.98"},{"v":0.075,"d":"7.50%"},{"v":142.8,"d":"142.80"},{"v":2826.65,"d":"2,826.65"},{"v":0.15,"d":"15.00%"},{"v":354.8,"d":"354.80"},{"v":3751.05,"d":"3,751.05"},{"v":0.225,"d":"22.50%"},636.13,{"v":4664.68,"d":"4,664.68"},{"v":0.275,"d":"27.50%"},869.36,189.59]
["2019-11-01",{"v":0,"d":"0.00%"},0,{"v":1903.98,"d":"1,903.98"},{"v":0.075,"d":"7.50%"},{"v":142.8,"d":"142.80"},{"v":2826.65,"d":"2,826.65"},{"v":0.15,"d":"15.00%"},{"v":354.8,"d":"354.80"},{"v":3751.05,"d":"3,751.05"},{"v":0.225,"d":"22.50%"},636.13,{"v":4664.68,"d":"4,664.68"},{"v":0.275,"d":"27.50%"},869.36,189.59]
["2019-12-01",{"v":0,"d":"0.00%"},0,{"v":1903.98,"d":"1,903.98"},{"v":0.075,"d":"7.50%"},{"v":142.8,"d":"142.80"},{"v":2826.65,"d":"2,826.65"},{"v":0.15,"d":"15.00%"},{"v":354.8,"d":"354.80"},{"v":3751.05,"d":"3,751.05"},{"v":0.225,"d":"22.50%"},636.13,{"v":4664.68,"d":"4,664.68"},{"v":0.275,"d":"27.50%"},869.36,189.59]
["2020-01-01",{"v":0,"d":"0.00%"},0,{"v":1903.98,"d":"1,903.98"},{"v":0.075,"d":"7.50%"},{"v":142.8,"d":"142.80"},{"v":2826.65,"d":"2,826.65"},{"v":0.15,"d":"15.00%"},{"v":354.8,"d":"354.80"},{"v":3751.05,"d":"3,751.05"},{"v":0.225,"d":"22.50%"},636.13,{"v":4664.68,"d":"4,664.68"},{"v":0.275,"d":"27.50%"},869.36,189.59]
["2020-02-01",{"v":0,"d":"0.00%"},0,{"v":1903.98,"d":"1,903.98"},{"v":0.075,"d":"7.50%"},{"v":142.8,"d":"142.80"},{"v":2826.65,"d":"2,826.65"},{"v":0.15,"d":"15.00%"},{"v":354.8,"d":"354.80"},{"v":3751.05,"d":"3,751.05"},{"v":0.225,"d":"22.50%"},636.13,{"v":4664.68,"d":"4,664.68"},{"v":0.275,"d":"27.50%"},869.36,189.59]
["2020-03-01",{"v":0,"d":"0.00%"},0,{"v":1903.98,"d":"1,903.98"},{"v":0.075,"d":"7.50%"},{"v":142.8,"d":"142.80"},{"v":2826.65,"d":"2,826.65"},{"v":0.15,"d":"15.00%"},{"v":354.8,"d":"354.80"},{"v":3751.05,"d":"3,751.05"},{"v":0.225,"d":"22.50%"},636.13,{"v":4664.68,"d":"4,664.68"},{"v":0.275,"d":"27.50%"},869.36,189.59]
["2020-04-01",{"v":0,"d":"0.00%"},0,{"v":1903.98,"d":"1,903.98"},{"v":0.075,"d":"7.50%"},{"v":142.8,"d":"142.80"},{"v":2826.65,"d":"2,826.65"},{"v":0.15,"d":"15.00%"},{"v":354.8,"d":"354.80"},{"v":3751.05,"d":"3,751.05"},{"v":0.225,"d":"22.50%"},636.13,{"v":4664.68,"d":"4,664.68"},{"v":0.275,"d":"27.50%"},869.36,189.59]
["2020-05-01",{"v":0,"d":"0.00%"},0,{"v":1903.98,"d":"1,903.98"},{"v":0.075,"d":"7.50%"},{"v":142.8,"d":"142.80"},{"v":2826.65,"d":"2,826.65"},{"v":0.15,"d":"15.00%"},{"v":354.8,"d":"354.80"},{"v":3751.05,"d":"3,751.05"},{"v":0.225,"d":"22.50%"},636.13,{"v":4664.68,"d":"4,664.68"},{"v":0.275,"d":"27.50%"},869.36,189.59]
["2020-06-01",{"v":0,"d":"0.00%"},0,{"v":1903.98,"d":"1,903.98"},{"v":0.075,"d":"7.50%"},{"v":142.8,"d":"142.80"},{"v":2826.65,"d":"2,826.65"},{"v":0.15,"d":"15.00%"},{"v":354.8,"d":"354.80"},{"v":3751.05,"d":"3,751.05"},{"v":0.225,"d":"22.50%"},636.13,{"v":4664.68,"d":"4,664.68"},{"v":0.275,"d":"27.50%"},869.36,189.59]
["2020-07-01",{"v":0,"d":"0.00%"},0,{"v":1903.98,"d":"1,903.98"},{"v":0.075,"d":"7.50%"},{"v":142.8,"d":"142.80"},{"v":2826.65,"d":"2,826.65"},{"v":0.15,"d":"15.00%"},{"v":354.8,"d":"354.80"},{"v":3751.05,"d":"3,751.05"},{"v":0.225,"d":"22.50%"},636.13,{"v":4664.68,"d":"4,664.68"},{"v":0.275,"d":"27.50%"},869.36,189.59]
["2020-08-01",{"v":0,"d":"0.00%"},0,{"v":1903.98,"d":"1,903.98"},{"v":0.075,"d":"7.50%"},{"v":142.8,"d":"142.80"},{"v":2826.65,"d":"2,826.65"},{"v":0.15,"d":"15.00%"},{"v":354.8,"d":"354.80"},{"v":3751.05,"d":"3,751.05"},{"v":0.225,"d":"22.50%"},636.13,{"v":4664.68,"d":"4,664.68"},{"v":0.275,"d":"27.50%"},869.36,189.59]
["2020-09-01",{"v":0,"d":"0.00%"},0,{"v":1903.98,"d":"1,903.98"},{"v":0.075,"d":"7.50%"},{"v":142.8,"d":"142.80"},{"v":2826.65,"d":"2,826.65"},{"v":0.15,"d":"15.00%"},{"v":354.8,"d":"354.80"},{"v":3751.05,"d":"3,751.05"},{"v":0.225,"d":"22.50%"},636.13,{"v":4664.68,"d":"4,664.68"},{"v":0.275,"d":"27.50%"},869.36,189.59]
["2020-10-01",{"v":0,"d":"0.00%"},0,{"v":1903.98,"d":"1,903.98"},{"v":0.075,"d":"7.50%"},{"v":142.8,"d":"142.80"},{"v":2826.65,"d":"2,826.65"},{"v":0.15,"d":"15.00%"},{"v":354.8,"d":"354.80"},{"v":3751.05,"d":"3,751.05"},{"v":0.225,"d":"22.50%"},636.13,{"v":4664.68,"d":"4,664.68"},{"v":0.275,"d":"27.50%"},869.36,189.59]
["2020-11-01",{"v":0,"d":"0.00%"},0,{"v":1903.98,"d":"1,903.98"},{"v":0.075,"d":"7.50%"},{"v":142.8,"d":"142.80"},{"v":2826.65,"d":"2,826.65"},{"v":0.15,"d":"15.00%"},{"v":354.8,"d":"354.80"},{"v":3751.05,"d":"3,751.05"},{"v":0.225,"d":"22.50%"},636.13,{"v":4664.68,"d":"4,664.68"},{"v":0.275,"d":"27.50%"},869.36,189.59]
["2020-12-01",{"v":0,"d":"0.00%"},0,{"v":1903.98,"d":"1,903.98"},{"v":0.075,"d":"7.50%"},{"v":142.8,"d":"142.80"},{"v":2826.65,"d":"2,826.65"},{"v":0.15,"d":"15.00%"},{"v":354.8,"d":"354.80"},{"v":3751.05,"d":"3,751.05"},{"v":0.225,"d":"22.50%"},636.13,{"v":4664.68,"d":"4,664.68"},{"v":0.275,"d":"27.50%"},869.36,189.59]
["2021-01-01",{"v":0,"d":"0.00%"},0,{"v":1903.98,"d":"1,903.98"},{"v":0.075,"d":"7.50%"},{"v":142.8,"d":"142.80"},{"v":2826.65,"d":"2,826.65"},{"v":0.15,"d":"15.00%"},{"v":354.8,"d":"354.80"},{"v":3751.05,"d":"3,751.05"},{"v":0.225,"d":"22.50%"},636.13,{"v":4664.68,"d":"4,664.68"},{"v":0.275,"d":"27.50%"},869.36,189.59]
["2021-02-01",{"v":0,"d":"0.00%"},0,{"v":1903.98,"d":"1,903.98"},{"v":0.075,"d":"7.50%"},{"v":142.8,"d":"142.80"},{"v":2826.65,"d":"2,826.65"},{"v":0.15,"d":"15.00%"},{"v":354.8,"d":"354.80"},{"v":3751.05,"d":"3,751.05"},{"v":0.225,"d":"22.50%"},636.13,{"v":4664.68,"d":"4,664.68"},{"v":0.275,"d":"27.50%"},869.36,189.59]
["2021-03-01",{"v":0,"d":"0.00%"},0,{"v":1903.98,"d":"1,903.98"},{"v":0.075,"d":"7.50%"},{"v":142.8,"d":"142.80"},{"v":2826.65,"d":"2,826.65"},{"v":0.15,"d":"15.00%"},{"v":354.8,"d":"354.80"},{"v":3751.05,"d":"3,751.05"},{"v":0.225,"d":"22.50%"},636.13,{"v":4664.68,"d":"4,664.68"},{"v":0.275,"d":"27.50%"},869.36,189.59]
["2021-04-01",{"v":0,"d":"0.00%"},0,{"v":1903.98,"d":"1,903.98"},{"v":0.075,"d":"7.50%"},{"v":142.8,"d":"142.80"},{"v":2826.65,"d":"2,826.65"},{"v":0.15,"d":"15.00%"},{"v":354.8,"d":"354.80"},{"v":3751.05,"d":"3,751.05"},{"v":0.225,"d":"22.50%"},636.13,{"v":4664.68,"d":"4,664.68"},{"v":0.275,"d":"27.50%"},869.36,189.59]
["2021-05-01",{"v":0,"d":"0.00%"},0,{"v":1903.98,"d":"1,903.98"},{"v":0.075,"d":"7.50%"},{"v":142.8,"d":"142.80"},{"v":2826.65,"d":"2,826.65"},{"v":0.15,"d":"15.00%"},{"v":354.8,"d":"354.80"},{"v":3751.05,"d":"3,751.05"},{"v":0.225,"d":"22.50%"},636.13,{"v":4664.68,"d":"4,664.68"},{"v":0.275,"d":"27.50%"},869.36,189.59]
["2021-06-01",{"v":0,"d":"0.00%"},0,{"v":1903.98,"d":"1,903.98"},{"v":0.075,"d":"7.50%"},{"v":142.8,"d":"142.80"},{"v":2826.65,"d":"2,826.65"},{"v":0.15,"d":"15.00%"},{"v":354.8,"d":"354.80"},{"v":3751.05,"d":"3,751.05"},{"v":0.225,"d":"22.50%"},636.13,{"v":4664.68,"d":"4,664.68"},{"v":0.275,"d":"27.50%"},869.36,189.59]
["2021-07-01",{"v":0,"d":"0.00%"},0,{"v":1903.98,"d":"1,903.98"},{"v":0.075,"d":"7.50%"},{"v":142.8,"d":"142.80"},{"v":2826.65,"d":"2,826.65"},{"v":0.15,"d":"15.00%"},{"v":354.8,"d":"354.80"},{"v":3751.05,"d":"3,751.05"},{"v":0.225,"d":"22.50%"},636.13,{"v":4664.68,"d":"4,664.68"},{"v":0.275,"d":"27.50%"},869.36,189.59]
["2021-08-01",{"v":0,"d":"0.00%"},0,{"v":1903.98,"d":"1,903.98"},{"v":0.075,"d":"7.50%"},{"v":142.8,"d":"142.80"},{"v":2826.65,"d":"2,826.65"},{"v":0.15,"d":"15.00%"},{"v":354.8,"d":"354.80"},{"v":3751.05,"d":"3,751.05"},{"v":0.225,"d":"22.50%"},636.13,{"v":4664.68,"d":"4,664.68"},{"v":0.275,"d":"27.50%"},869.36,189.59]
["2021-09-01",{"v":0,"d":"0.00%"},0,{"v":1903.98,"d":"1,903.98"},{"v":0.075,"d":"7.50%"},{"v":142.8,"d":"142.80"},{"v":2826.65,"d":"2,826.65"},{"v":0.15,"d":"15.00%"},{"v":354.8,"d":"354.80"},{"v":3751.05,"d":"3,751.05"},{"v":0.225,"d":"22.50%"},636.13,{"v":4664.68,"d":"4,664.68"},{"v":0.275,"d":"27.50%"},869.36,189.59]
["2021-10-01",{"v":0,"d":"0.00%"},0,{"v":1903.98,"d":"1,903.98"},{"v":0.075,"d":"7.50%"},{"v":142.8,"d":"142.80"},{"v":2826.65,"d":"2,826.65"},{"v":0.15,"d":"15.00%"},{"v":354.8,"d":"354.80"},{"v":3751.05,"d":"3,751.05"},{"v":0.225,"d":"22.50%"},636.13,{"v":4664.68,"d":"4,664.68"},{"v":0.275,"d":"27.50%"},869.36,189.59]
["2021-11-01",{"v":0,"d":"0.00%"},0,{"v":1903.98,"d":"1,903.98"},{"v":0.075,"d":"7.50%"},{"v":142.8,"d":"142.80"},{"v":2826.65,"d":"2,826.65"},{"v":0.15,"d":"15.00%"},{"v":354.8,"d":"354.80"},{"v":3751.05,"d":"3,751.05"},{"v":0.225,"d":"22.50%"},636.13,{"v":4664.68,"d":"4,664.68"},{"v":0.275,"d":"27.50%"},869.36,189.59]
["2021-12-01",{"v":0,"d":"0.00%"},0,{"v":1903.98,"d":"1,903.98"},{"v":0.075,"d":"7.50%"},{"v":142.8,"d":"142.80"},{"v":2826.65,"d":"2,826.65"},{"v":0.15,"d":"15.00%"},{"v":354.8,"d":"354.80"},{"v":3751.05,"d":"3,751.05"},{"v":0.225,"d":"22.50%"},636.13,{"v":4664.68,"d":"4,664.68"},{"v":0.275,"d":"27.50%"},869.36,189.59]
["2022-01-01",{"v":0,"d":"0.00%"},0,{"v":1903.98,"d":"1,903.98"},{"v":0.075,"d":"7.50%"},{"v":142.8,"d":"142.80"},{"v":2826.65,"d":"2,826.65"},{"v":0.15,"d":"15.00%"},{"v":354.8,"d":"354.80"},{"v":3751.05,"d":"3,751.05"},{"v":0.225,"d":"22.50%"},636.13,{"v":4664.68,"d":"4,664.68"},{"v":0.275,"d":"27.50%"},869.36,189.59]
["2022-02-01",{"v":0,"d":"0.00%"},0,{"v":1903.98,"d":"1,903.98"},{"v":0.075,"d":"7.50%"},{"v":142.8,"d":"142.80"},{"v":2826.65,"d":"2,826.65"},{"v":0.15,"d":"15.00%"},{"v":354.8,"d":"354.80"},{"v":3751.05,"d":"3,751.05"},{"v":0.225,"d":"22.50%"},636.13,{"v":4664.68,"d":"4,664.68"},{"v":0.275,"d":"27.50%"},869.36,189.59]
["2022-03-01",{"v":0,"d":"0.00%"},0,{"v":1903.98,"d":"1,903.98"},{"v":0.075,"d":"7.50%"},{"v":142.8,"d":"142.80"},{"v":2826.65,"d":"2,826.65"},{"v":0.15,"d":"15.00%"},{"v":354.8,"d":"354.80"},{"v":3751.05,"d":"3,751.05"},{"v":0.225,"d":"22.50%"},636.13,{"v":4664.68,"d":"4,664.68"},{"v":0.275,"d":"27.50%"},869.36,189.59]
["2022-04-01",{"v":0,"d":"0.00%"},0,{"v":1903.98,"d":"1,903.98"},{"v":0.075,"d":"7.50%"},{"v":142.8,"d":"142.80"},{"v":2826.65,"d":"2,826.65"},{"v":0.15,"d":"15.00%"},{"v":354.8,"d":"354.80"},{"v":3751.05,"d":"3,751.05"},{"v":0.225,"d":"22.50%"},636.13,{"v":4664.68,"d":"4,664.68"},{"v":0.275,"d":"27.50%"},869.36,189.59]
["2022-05-01",{"v":0,"d":"0.00%"},0,{"v":1903.98,"d":"1,903.98"},{"v":0.075,"d":"7.50%"},{"v":142.8,"d":"142.80"},{"v":2826.65,"d":"2,826.65"},{"v":0.15,"d":"15.00%"},{"v":354.8,"d":"354.80"},{"v":3751.05,"d":"3,751.05"},{"v":0.225,"d":"22.50%"},636.13,{"v":4664.68,"d":"4,664.68"},{"v":0.275,"d":"27.50%"},869.36,189.59]
["2022-06-01",{"v":0,"d":"0.00%"},0,{"v":1903.98,"d":"1,903.98"},{"v":0.075,"d":"7.50%"},{"v":142.8,"d":"142.80"},{"v":2826.65,"d":"2,826.65"},{"v":0.15,"d":"15.00%"},{"v":354.8,"d":"354.80"},{"v":3751.05,"d":"3,751.05"},{"v":0.225,"d":"22.50%"},636.13,{"v":4664.68,"d":"4,664.68"},{"v":0.275,"d":"27.50%"},869.36,189.59]
["2022-07-01",{"v":0,"d":"0.00%"},0,{"v":1903.98,"d":"1,903.98"},{"v":0.075,"d":"7.50%"},{"v":142.8,"d":"142.80"},{"v":2826.65,"d":"2,826.65"},{"v":0.15,"d":"15.00%"},{"v":354.8,"d":"354.80"},{"v":3751.05,"d":"3,751.05"},{"v":0.225,"d":"22.50%"},636.13,{"v":4664.68,"d":"4,664.68"},{"v":0.275,"d":"27.50%"},869.36,189.59]
["2022-08-01",{"v":0,"d":"0.00%"},0,{"v":1903.98,"d":"1,903.98"},{"v":0.075,"d":"7.50%"},{"v":142.8,"d":"142.80"},{"v":2826.65,"d":"2,826.65"},{"v":0.15,"d":"15.00%"},{"v":354.8,"d":"354.80"},{"v":3751.05,"d":"3,751.05"},{"v":0.225,"d":"22.50%"},636.13,{"v":4664.68,"d":"4,664.68"},{"v":0.275,"d":"27.50%"},869.36,189.59]
["2022-09-01",{"v":0,"d":"0.00%"},0,{"v":1903.98,"d":"1,903.98"},{"v":0.075,"d":"7.50%"},{"v":142.8,"d":"142.80"},{"v":2826.65,"d":"2,826.65"},{"v":0.15,"d":"15.00%"},{"v":354.8,"d":"354.80"},{"v":3751.05,"d":"3,751.05"},{"v":0.225,"d":"22.50%"},636.13,{"v":4664.68,"d":"4,664.68"},{"v":0.275,"d":"27.50%"},869.36,189.59]
["2022-10-01",{"v":0,"d":"0.00%"},0,{"v":1903.98,"d":"1,903.98"},{"v":0.075,"d":"7.50%"},{"v":142.8,"d":"142.80"},{"v":2826.65,"d":"2,826.65"},{"v":0.15,"d":"15.00%"},{"v":354.8,"d":"354.80"},{"v":3751.05,"d":"3,751.05"},{"v":0.225,"d":"22.50%"},636.13,{"v":4664.68,"d":"4,664.68"},{"v":0.275,"d":"27.50%"},869.36,189.59]
["2022-11-01",{"v":0,"d":"0.00%"},0,{"v":1903.98,"d":"1,903.98"},{"v":0.075,"d":"7.50%"},{"v":142.8,"d":"142.80"},{"v":2826.65,"d":"2,826.65"},{"v":0.15,"d":"15.00%"},{"v":354.8,"d":"354.80"},{"v":3751.05,"d":"3,751.05"},{"v":0.225,"d":"22.50%"},636.13,{"v":4664.68,"d":"4,664.68"},{"v":0.275,"d":"27.50%"},869.36,189.59]
["2022-12-01",{"v":0,"d":"0.00%"},0,{"v":1903.98,"d":"1,903.98"},{"v":0.075,"d":"7.50%"},{"v":142.8,"d":"142.80"},{"v":2826.65,"d":"2,826.65"},{"v":0.15,"d":"15.00%"},{"v":354.8,"d":"354.80"},{"v":3751.05,"d":"3,751.05"},{"v":0.225,"d":"22.50%"},636.13,{"v":4664.68,"d":"4,664.68"},{"v":0.275,"d":"27.50%"},869.36,189.59]
["2023-01-01",{"v":0,"d":"0.00%"},0,{"v":1903.98,"d":"1,903.98"},{"v":0.075,"d":"7.50%"},{"v":142.8,"d":"142.80"},{"v":2826.65,"d":"2,826.65"},{"v":0.15,"d":"15.00%"},{"v":354.8,"d":"354.80"},{"v":3751.05,"d":"3,751.05"},{"v":0.225,"d":"22.50%"},636.13,{"v":4664.68,"d":"4,664.68"},{"v":0.275,"d":"27.50%"},869.36,189.59]
["2023-02-01",{"v":0,"d":"0.00%"},0,{"v":1903.98,"d":"1,903.98"},{"v":0.075,"d":"7.50%"},{"v":142.8,"d":"142.80"},{"v":2826.65,"d":"2,826.65"},{"v":0.15,"d":"15.00%"},{"v":354.8,"d":"354.80"},{"v":3751.05,"d":"3,751.05"},{"v":0.225,"d":"22.50%"},636.13,{"v":4664.68,"d":"4,664.68"},{"v":0.275,"d":"27.50%"},869.36,189.59]
["2023-03-01",{"v":0,"d":"0.00%"},0,{"v":1903.98,"d":"1,903.98"},{"v":0.075,"d":"7.50%"},{"v":142.8,"d":"142.80"},{"v":2826.65,"d":"2,826.65"},{"v":0.15,"d":"15.00%"},{"v":354.8,"d":"354.80"},{"v":3751.05,"d":"3,751.05"},{"v":0.225,"d":"22.50%"},636.13,{"v":4664.68,"d":"4,664.68"},{"v":0.275,"d":"27.50%"},869.36,189.59]
["2023-04-01",{"v":0,"d":"0.00%"},0,{"v":1903.98,"d":"1,903.98"},{"v":0.075,"d":"7.50%"},{"v":142.8,"d":"142.80"},{"v":2826.65,"d":"2,826.65"},{"v":0.15,"d":"15.00%"},{"v":354.8,"d":"354.80"},{"v":3751.05,"d":"3,751.05"},{"v":0.225,"d":"22.50%"},636.13,{"v":4664.68,"d":"4,664.68"},{"v":0.275,"d":"27.50%"},869.36,189.59]
["2023-05-01",{"v":0,"d":"0.00%"},0,{"v":2112.01,"d":"2,112.01"},{"v":0.075,"d":"7.50%"},{"v":158.4,"d":"158.40"},{"v":2826.65,"d":"2,826.65"},{"v":0.15,"d":"15.00%"},{"v":370.4,"d":"370.40"},{"v":3751.05,"d":"3,751.05"},{"v":0.225,"d":"22.50%"},651.73,{"v":4664.68,"d":"4,664.68"},{"v":0.275,"d":"27.50%"},884.96,189.59,{"v":528,"d":"528.00"}]
["2023-06-01",{"v":0,"d":"0.00%"},0,{"v":2112.01,"d":"2,112.01"},{"v":0.075,"d":"7.50%"},{"v":158.4,"d":"158.40"},{"v":2826.65,"d":"2,826.65"},{"v":0.15,"d":"15.00%"},{"v":370.4,"d":"370.40"},{"v":3751.05,"d":"3,751.05"},{"v":0.225,"d":"22.50%"},651.73,{"v":4664.68,"d":"4,664.68"},{"v":0.275,"d":"27.50%"},884.96,189.59,{"v":528,"d":"528.00"}]
["2023-07-01",{"v":0,"d":"0.00%"},0,{"v":2112.01,"d":"2,112.01"},{"v":0.075,"d":"7.50%"},{"v":158.4,"d":"158.40"},{"v":2826.65,"d":"2,826.65"},{"v":0.15,"d":"15.00%"},{"v":370.4,"d":"370.40"},{"v":3751.05,"d":"3,751.05"},{"v":0.225,"d":"22.50%"},651.73,{"v":4664.68,"d":"4,664.68"},{"v":0.275,"d":"27.50%"},884.96,189.59,{"v":528,"d":"528.00"}]
["2023-08-01",{"v":0,"d":"0.00%"},0,{"v":2112.01,"d":"2,112.01"},{"v":0.075,"d":"7.50%"},{"v":158.4,"d":"158.40"},{"v":2826.65,"d":"2,826.65"},{"v":0.15,"d":"15.00%"},{"v":370.4,"d":"370.40"},{"v":3751.05,"d":"3,751.05"},{"v":0.225,"d":"22.50%"},651.73,{"v":4664.68,"d":"4,664.68"},{"v":0.275,"d":"27.50%"},884.96,189.59,{"v":528,"d":"528.00"}]
["2023-09-01",{"v":0,"d":"0.00%"},0,{"v":2112.01,"d":"2,112.01"},{"v":0.075,"d":"7.50%"},{"v":158.4,"d":"158.40"},{"v":2826.65,"d":"2,826.65"},{"v":0.15,"d":"15.00%"},{"v":370.4,"d":"370.40"},{"v":3751.05,"d":"3,751.05"},{"v":0.225,"d":"22.50%"},651.73,{"v":4664.68,"d":"4,664.68"},{"v":0.275,"d":"27.50%"},884.96,189.59,{"v":528,"d":"528.00"}]
["2023-10-01",{"v":0,"d":"0.00%"},0,{"v":2112.01,"d":"2,112.01"},{"v":0.075,"d":"7.50%"},{"v":158.4,"d":"158.40"},{"v":2826.65,"d":"2,826.65"},{"v":0.15,"d":"15.00%"},{"v":370.4,"d":"370.40"},{"v":3751.05,"d":"3,751.05"},{"v":0.225,"d":"22.50%"},651.73,{"v":4664.68,"d":"4,664.68"},{"v":0.275,"d":"27.50%"},884.96,189.59,{"v":528,"d":"528.00"}]
["2023-11-01",{"v":0,"d":"0.00%"},0,{"v":2112.01,"d":"2,112.01"},{"v":0.075,"d":"7.50%"},{"v":158.4,"d":"158.40"},{"v":2826.65,"d":"2,826.65"},{"v":0.15,"d":"15.00%"},{"v":370.4,"d":"370.40"},{"v":3751.05,"d":"3,751.05"},{"v":0.225,"d":"22.50%"},651.73,{"v":4664.68,"d":"4,664.68"},{"v":0.275,"d":"27.50%"},884.96,189.59,{"v":528,"d":"528.00"}]
["2023-12-01",{"v":0,"d":"0.00%"},0,{"v":2112.01,"d":"2,112.01"},{"v":0.075,"d":"7.50%"},{"v":158.4,"d":"158.40"},{"v":2826.65,"d":"2,826.65"},{"v":0.15,"d":"15.00%"},{"v":370.4,"d":"370.40"},{"v":3751.05,"d":"3,751.05"},{"v":0.225,"d":"22.50%"},651.73,{"v":4664.68,"d":"4,664.68"},{"v":0.275,"d":"27.50%"},884.96,189.59,{"v":528,"d":"528.00"}]
["2024-01-01",{"v":0,"d":"0.00%"},0,{"v":2112.01,"d":"2,112.01"},{"v":0.075,"d":"7.50%"},{"v":158.4,"d":"158.40"},{"v":2826.65,"d":"2,826.65"},{"v":0.15,"d":"15.00%"},{"v":370.4,"d":"370.40"},{"v":3751.05,"d":"3,751.05"},{"v":0.225,"d":"22.50%"},651.73,{"v":4664.68,"d":"4,664.68"},{"v":0.275,"d":"27.50%"},884.96,189.59,{"v":528,"d":"528.00"}]
["2024-02-01",{"v":0,"d":"0.00%"},0,{"v":2112.01,"d":"2,112.01"},{"v":0.075,"d":"7.50%"},{"v":158.4,"d":"158.40"},{"v":2826.65,"d":"2,826.65"},{"v":0.15,"d":"15.00%"},{"v":370.4,"d":"370.40"},{"v":3751.05,"d":"3,751.05"},{"v":0.225,"d":"22.50%"},651.73,{"v":4664.68,"d":"4,664.68"},{"v":0.275,"d":"27.50%"},884.96,189.59,{"v":528,"d":"528.00"}]
["2024-03-01",{"v":0,"d":"0.00%"},0,{"v":2112.01,"d":"2,112.01"},{"v":0.075,"d":"7.50%"},{"v":158.4,"d":"158.40"},{"v":2826.65,"d":"2,826.65"},{"v":0.15,"d":"15.00%"},{"v":370.4,"d":"370.40"},{"v":3751.05,"d":"3,751.05"},{"v":0.225,"d":"22.50%"},651.73,{"v":4664.68,"d":"4,664.68"},{"v":0.275,"d":"27.50%"},884.96,189.59,{"v":528,"d":"528.00"}]
["2024-04-01",{"v":0,"d":"0.00%"},0,{"v":2112.01,"d":"2,112.01"},{"v":0.075,"d":"7.50%"},{"v":158.4,"d":"158.40"},{"v":2826.65,"d":"2,826.65"},{"v":0.15,"d":"15.00%"},{"v":370.4,"d":"370.40"},{"v":3751.05,"d":"3,751.05"},{"v":0.225,"d":"22.50%"},651.73,{"v":4664.68,"d":"4,664.68"},{"v":0.275,"d":"27.50%"},884.96,189.59,{"v":528,"d":"528.00"}]
["2024-05-01",{"v":0,"d":"0.00%"},0,{"v":2112.01,"d":"2,112.01"},{"v":0.075,"d":"7.50%"},{"v":158.4,"d":"158.40"},{"v":2826.65,"d":"2,826.65"},{"v":0.15,"d":"15.00%"},{"v":370.4,"d":"370.40"},{"v":3751.05,"d":"3,751.05"},{"v":0.225,"d":"22.50%"},651.73,{"v":4664.68,"d":"4,664.68"},{"v":0.275,"d":"27.50%"},884.96,189.59,{"v":528,"d":"528.00"}]
["2024-06-01",{"v":0,"d":"0.00%"},0,{"v":2112.01,"d":"2,112.01"},{"v":0.075,"d":"7.50%"},{"v":158.4,"d":"158.40"},{"v":2826.65,"d":"2,826.65"},{"v":0.15,"d":"15.00%"},{"v":370.4,"d":"370.40"},{"v":3751.05,"d":"3,751.05"},{"v":0.225,"d":"22.50%"},651.73,{"v":4664.68,"d":"4,664.68"},{"v":0.275,"d":"27.50%"},884.96,189.59,{"v":528,"d":"528.00"}]
["2024-07-01",{"v":0,"d":"0.00%"},0,{"v":2112.01,"d":"2,112.01"},{"v":0.075,"d":"7.50%"},{"v":158.4,"d":"158.40"},{"v":2826.65,"d":"2,826.65"},{"v":0.15,"d":"15.00%"},{"v":370.4,"d":"370.40"},{"v":3751.05,"d":"3,751.05"},{"v":0.225,"d":"22.50%"},651.73,{"v":4664.68,"d":"4,664.68"},{"v":0.275,"d":"27.50%"},884.96,189.59,{"v":528,"d":"528.00"}]
["2024-08-01",{"v":0,"d":"0.00%"},0,{"v":2112.01,"d":"2,112.01"},{"v":0.075,"d":"7.50%"},{"v":158.4,"d":"158.40"},{"v":2826.65,"d":"2,826.65"},{"v":0.15,"d":"15.00%"},{"v":370.4,"d":"370.40"},{"v":3751.05,"d":"3,751.05"},{"v":0.225,"d":"22.50%"},651.73,{"v":4664.68,"d":"4,664.68"},{"v":0.275,"d":"27.50%"},884.96,189.59,{"v":528,"d":"528.00"}]
["2024-09-01",{"v":0,"d":"0.00%"},0,{"v":2112.01,"d":"2,112.01"},{"v":0.075,"d":"7.50%"},{"v":158.4,"d":"158.40"},{"v":2826.65,"d":"2,826.65"},{"v":0.15,"d":"15.00%"},{"v":370.4,"d":"370.40"},{"v":3751.05,"d":"3,751.05"},{"v":0.225,"d":"22.50%"},651.73,{"v":4664.68,"d":"4,664.68"},{"v":0.275,"d":"27.50%"},884.96,189.59,{"v":528,"d":"528.00"}]
["2024-10-01",{"v":0,"d":"0.00%"},0,{"v":2112.01,"d":"2,112.01"},{"v":0.075,"d":"7.50%"},{"v":158.4,"d":"158.40"},{"v":2826.65,"d":"2,826.65"},{"v":0.15,"d":"15.00%"},{"v":370.4,"d":"370.40"},{"v":3751.05,"d":"3,751.05"},{"v":0.225,"d":"22.50%"},651.73,{"v":4664.68,"d":"4,664.68"},{"v":0.275,"d":"27.50%"},884.96,189.59,{"v":528,"d":"528.00"}]
["2024-11-01",{"v":0,"d":"0.00%"},0,{"v":2112.01,"d":"2,112.01"},{"v":0.075,"d":"7.50%"},{"v":158.4,"d":"158.40"},{"v":2826.65,"d":"2,826.65"},{"v":0.15,"d":"15.00%"},{"v":370.4,"d":"370.40"},{"v":3751.05,"d":"3,751.05"},{"v":0.225,"d":"22.50%"},651.73,{"v":4664.68,"d":"4,664.68"},{"v":0.275,"d":"27.50%"},884.96,189.59,{"v":528,"d":"528.00"}]
["2024-12-01",{"v":0,"d":"0.00%"},0,{"v":2112.01,"d":"2,112.01"},{"v":0.075,"d":"7.50%"},{"v":158.4,"d":"158.40"},{"v":2826.65,"d":"2,826.65"},{"v":0.15,"d":"15.00%"},{"v":370.4,"d":"370.40"},{"v":3751.05,"d":"3,751.05"},{"v":0.225,"d":"22.50%"},651.73,{"v":4664.68,"d":"4,664.68"},{"v":0.275,"d":"27.50%"},884.96,189.59,{"v":528,"d":"528.00"}]